Raspbian Package Auto-Building

Buildd status for qutecsound (stretch-staging)

Debian PTSTrackerChangelogBugspackages.d.obuildd.d.o

Package(s): Suite:
Compact mode Co-maintainers

ArchitectureVersionStatusForBuilddStateMiscLogs
Buildd exposure stats armhf  0.6.1-2Build-Attempted899d 19h 31mmb-lxc-01uncompiledsound:sourceold | all (2)

Tail of log for qutecsound on armhf:

src/csoundengine.cpp:795:44: error: 'struct CsoundUserData' has no member named 'channelList'
       CsoundChannelListEntry *chnls = *ud->channelList;
                                            ^~~~~~~~~~~
src/csoundengine.cpp:817:49: error: 'csoundSetInputValueCallback' was not declared in this scope
     csoundSetInputValueCallback(ud->csound, NULL);
                                                 ^
src/csoundengine.cpp:818:50: error: 'csoundSetOutputValueCallback' was not declared in this scope
     csoundSetOutputValueCallback(ud->csound, NULL);
                                                  ^
Makefile:785: recipe for target 'build/doubles/release/obj/csoundengine.o' failed
make[1]: *** [build/doubles/release/obj/csoundengine.o] Error 1
make[1]: *** Waiting for unfinished jobs....
make[1]: Leaving directory '/<<PKGBUILDDIR>>'
/usr/share/cdbs/1/class/makefile.mk:77: recipe for target 'debian/stamp-makefile-build' failed
make: *** [debian/stamp-makefile-build] Error 2