Raspbian Package Auto-Building

Buildd status for qtjsbackend-opensource-src (buster-staging)

Debian PTSTrackerChangelogBugspackages.d.obuildd.d.o

Package(s): Suite:
Compact mode Co-maintainers

ArchitectureVersionStatusForBuilddStateMiscLogs
Buildd exposure stats armhf  5.1.1-1Build-Attempted166d 6h 24mbm-wb-02uncompiledmisc:sourceold | all (30)

Tail of log for qtjsbackend-opensource-src on armhf:

../3rdparty/v8/src/objects.h:7486:36: error: left operand of shift expression '(-8 << 26)' is negative [-fpermissive]
       (~kMaxCachedArrayIndexLength << kArrayIndexHashLengthShift) |
       ~~~~~~~~~~~~~~~~~~~~~~~~~~~~~^~~~~~~~~~~~~~~~~~~~~~~~~~~~~~
make[3]: *** [Makefile:910: .obj/accessors.o] Error 1
make[3]: *** Waiting for unfinished jobs....
make[3]: *** [Makefile:1230: .obj/assembler.o] Error 1
make[3]: *** [Makefile:1348: .obj/ast.o] Error 1
make[3]: *** [Makefile:1083: .obj/api.o] Error 1
make[3]: Leaving directory '/<<PKGBUILDDIR>>/src/v8'
make[2]: *** [Makefile:89: sub-v8-make_first-ordered] Error 2
make[2]: Leaving directory '/<<PKGBUILDDIR>>/src'
make[1]: *** [Makefile:46: sub-src-make_first] Error 2
make[1]: Leaving directory '/<<PKGBUILDDIR>>'
dh_auto_build: make -j4 returned exit code 2
make: *** [debian/rules:14: build-arch] Error 25