Raspbian Package Auto-Building

Buildd status for qgis (wheezy-staging)

Debian PTSTrackerChangelogBugspackages.d.obuildd.d.o

Package(s): Suite:
Compact mode Co-maintainers

ArchitectureVersionStatusForBuilddStateMiscLogs
Buildd exposure stats armhf  1.7.4+1.7.5~20120320-1.1Build-Attempted1356d 17h 1mbm-wb-01uncompiledscience:sourceold | all (5)

Tail of log for qgis on armhf:

/<<BUILDDIR>>/qgis-1.7.4+1.7.5~20120320/src/core/qgscoordinatetransform.h:158:10: note: void QgsCoordinateTransform::transformInPlace(std::vector<double, std::allocator<double> >&, std::vector<double, std::allocator<double> >&, std::vector<double, std::allocator<double> >&, QgsCoordinateTransform::TransformDirection) const
/<<BUILDDIR>>/qgis-1.7.4+1.7.5~20120320/src/core/qgscoordinatetransform.h:158:10: note:   no known conversion for argument 1 from 'qreal {aka float}' to 'std::vector<double, std::allocator<double> >&'
/<<BUILDDIR>>/qgis-1.7.4+1.7.5~20120320/src/core/symbology-ng/qgsrendererv2.cpp:158:56: error: no matching function for call to 'QgsMapToPixel::transformInPlace(qreal&, qreal&) const'
/<<BUILDDIR>>/qgis-1.7.4+1.7.5~20120320/src/core/symbology-ng/qgsrendererv2.cpp:158:56: note: candidates are:
/<<BUILDDIR>>/qgis-1.7.4+1.7.5~20120320/src/core/qgsmaptopixel.h:69:10: note: void QgsMapToPixel::transformInPlace(double&, double&) const
/<<BUILDDIR>>/qgis-1.7.4+1.7.5~20120320/src/core/qgsmaptopixel.h:69:10: note:   no known conversion for argument 1 from 'qreal {aka float}' to 'double&'
/<<BUILDDIR>>/qgis-1.7.4+1.7.5~20120320/src/core/qgsmaptopixel.h:74:10: note: void QgsMapToPixel::transformInPlace(std::vector<double, std::allocator<double> >&, std::vector<double, std::allocator<double> >&) const
/<<BUILDDIR>>/qgis-1.7.4+1.7.5~20120320/src/core/qgsmaptopixel.h:74:10: note:   no known conversion for argument 1 from 'qreal {aka float}' to 'std::vector<double, std::allocator<double> >&'
make[3]: *** [src/core/CMakeFiles/qgis_core.dir/symbology-ng/qgsrendererv2.cpp.o] Error 1
make[3]: Leaving directory `/<<BUILDDIR>>/qgis-1.7.4+1.7.5~20120320/debian/build'
make[2]: *** [src/core/CMakeFiles/qgis_core.dir/all] Error 2
make[2]: Leaving directory `/<<BUILDDIR>>/qgis-1.7.4+1.7.5~20120320/debian/build'
make[1]: *** [all] Error 2
make[1]: Leaving directory `/<<BUILDDIR>>/qgis-1.7.4+1.7.5~20120320/debian/build'
make: *** [build-stamp] Error 2