Raspbian Package Auto-Building

Buildd status for qca2-plugin-ossl (buster-staging)

Debian PTSTrackerChangelogBugspackages.d.obuildd.d.o

Package(s): Suite:
Compact mode Co-maintainers

ArchitectureVersionStatusForBuilddStateMiscLogs
Buildd exposure stats armhf  2.0.0~beta3-2Build-Attempted164d 6h 21mmb-lxc-01uncompiledlibs:sourceold | all (25)

Tail of log for qca2-plugin-ossl on armhf:

    return new opensslPbkdf2Context( this, type );
                                                ^
qca-ossl.cpp: At global scope:
qca-ossl.cpp:4521:16: warning: 'QString opensslQCAPlugin::cipherIDtoString(const QCA::TLS::Version&, const long unsigned int&)' defined but not used [-Wunused-function]
 static QString cipherIDtoString( const TLS::Version &version, const unsigned long &cipherID)
                ^~~~~~~~~~~~~~~~
qca-ossl.cpp:86:19: warning: 'QCA::BigInteger opensslQCAPlugin::bn2bi(BIGNUM*)' defined but not used [-Wunused-function]
 static BigInteger bn2bi(BIGNUM *n)
                   ^~~~~
make[2]: *** [Makefile:223: qca-ossl.o] Error 1
make[2]: Leaving directory '/<<PKGBUILDDIR>>'
dh_auto_build: make -j4 returned exit code 2
make[1]: *** [/usr/share/pkg-kde-tools/qt-kde-team/2/dhmk.mk:97: pre_build-arch_dh_auto_build] Error 2
make[1]: Leaving directory '/<<PKGBUILDDIR>>'
make: *** [/usr/share/pkg-kde-tools/qt-kde-team/2/dhmk.mk:110: debian/dhmk_build-arch] Error 2