Raspbian Package Auto-Building

Buildd status for python-pysam (jessie-staging)

Debian PTSTrackerChangelogBugspackages.d.obuildd.d.o

Package(s): Suite:
Compact mode Co-maintainers

ArchitectureVersionStatusForBuilddStateMiscLogs
Buildd exposure stats armhf  0.7.7-1Build-Attempted183d 11h 40mbm-wb-04uncompiledmisc:sourceold | all (15)

Tail of log for python-pysam on armhf:

make[2]: *** [ex10.bam] Bus error
make[2]: *** Deleting file 'ex10.bam'
make[2]: Leaving directory '/<<PKGBUILDDIR>>/tests'
building data files
starting tests
.....................E...E../pysam_test_offline.py:473: UserWarning: fetch called for samfile without header
  result = list(infile.fetch())
................................................................EE.....................Bus error
E: pybuild pybuild:256: test: plugin custom failed with: exit code=135: cd tests && PYTHONPATH=/<<PKGBUILDDIR>>/.pybuild/pythonX.Y_2.7/build python2.7 ./pysam_test_offline.py
dh_auto_test: pybuild --test -i python{version} -p 2.7 --dir . returned exit code 13
debian/rules:29: recipe for target 'override_dh_auto_test' failed
make[1]: *** [override_dh_auto_test] Error 13
make[1]: Leaving directory '/<<PKGBUILDDIR>>'
debian/rules:9: recipe for target 'build-arch' failed
make: *** [build-arch] Error 2