Raspbian Package Auto-Building

Buildd status for python-peachpy (bullseye-staging)

Debian PTSTrackerChangelogBugspackages.d.obuildd.d.o

Package(s): Suite:
Compact mode Co-maintainers

ArchitectureVersionStatusForBuilddStateMiscLogs
Buildd exposure stats armhf  0.0~git20200303.f189ad2-3Build-Attempted65d 5h 38mmb-lxc-01uncompiledmisc:sourceold | all (2)

Tail of log for python-peachpy on armhf:

----------------------------------------------------------------------
Traceback (most recent call last):
  File "/<<PKGBUILDDIR>>/.pybuild/cpython3_3.8_peachpy/build/test/x86_64/test_load.py", line 28, in runTest
    py_multiply = asm_multiply.finalize(abi.detect()).encode().load()
  File "/<<PKGBUILDDIR>>/.pybuild/cpython3_3.8_peachpy/build/peachpy/x86_64/function.py", line 308, in finalize
    raise TypeError("%s is not an ABI object" % str(abi))
TypeError: None is not an ABI object

----------------------------------------------------------------------
Ran 1309 tests in 4.097s

FAILED (errors=1)
E: pybuild pybuild:352: test: plugin distutils failed with: exit code=1: cd '/<<PKGBUILDDIR>>/.pybuild/cpython3_3.8_peachpy/build'; python3.8 -m unittest discover -v 
dh_auto_test: error: pybuild --test -i python{version} -p 3.8 returned exit code 13
make: *** [debian/rules:8: binary-arch] Error 25