Raspbian Package Auto-Building

Buildd status for python-apt (stretch-staging)

Debian PTSTrackerChangelogBugspackages.d.obuildd.d.o

Package(s): Suite:
Compact mode Co-maintainers

ArchitectureVersionStatusForBuilddStateMiscLogs
Buildd exposure stats armhf  1.4.0~beta3Build-Attempted907d 7h 23mtestwandboardout-of-datepython:sourceold | all (3)

Tail of log for python-apt on armhf:

  File "/<<PKGBUILDDIR>>/build/lib.linux-armv7l-2.7/apt/auth.py", line 133, in add_key_from_keyserver
    _add_key_from_keyserver(keyid, keyserver, tmp_keyring_dir)
  File "/<<PKGBUILDDIR>>/build/lib.linux-armv7l-2.7/apt/auth.py", line 161, in _add_key_from_keyserver
    keyserver, keyid))
AptKeyError: recv from 'hkp://localhost:19191' failed for '0xa1bD8E9D78F7FE5C3E65D8AF8B48AD6246925553'

----------------------------------------------------------------------
Ran 94 tests in 127.753s

FAILED (errors=1, skipped=2)
debian/rules:50: recipe for target 'override_dh_auto_test' failed
make[1]: *** [override_dh_auto_test] Error 1
make[1]: Leaving directory '/<<PKGBUILDDIR>>'
debian/rules:16: recipe for target 'build-arch' failed
make: *** [build-arch] Error 2