Raspbian Package Auto-Building

Buildd status for pulseview (jessie-staging)

Debian PTSTrackerChangelogBugspackages.d.obuildd.d.o

Package(s): Suite:
Compact mode Co-maintainers

ArchitectureVersionStatusForBuilddStateMiscLogs
Buildd exposure stats armhf  0.2.0-1Build-Attempted127d 12h 17mmb-lxc-01uncompiledmisc:sourceold | all (12)

Tail of log for pulseview on armhf:

 #include <Python.h> /* First, so we avoid a _POSIX_C_SOURCE warning. */
                                                                        ^
compilation terminated.
CMakeFiles/pulseview.dir/build.make:280: recipe for target 'CMakeFiles/pulseview.dir/main.cpp.o' failed
make[3]: *** [CMakeFiles/pulseview.dir/main.cpp.o] Error 1
make[3]: Leaving directory '/<<PKGBUILDDIR>>/obj-arm-linux-gnueabihf'
CMakeFiles/Makefile2:63: recipe for target 'CMakeFiles/pulseview.dir/all' failed
make[2]: *** [CMakeFiles/pulseview.dir/all] Error 2
make[2]: Leaving directory '/<<PKGBUILDDIR>>/obj-arm-linux-gnueabihf'
Makefile:140: recipe for target 'all' failed
make[1]: *** [all] Error 2
make[1]: Leaving directory '/<<PKGBUILDDIR>>/obj-arm-linux-gnueabihf'
dh_auto_build: make -j1 returned exit code 2
debian/rules:6: recipe for target 'build-arch' failed
make: *** [build-arch] Error 2