Raspbian Package Auto-Building

Buildd status for proteinortho (bullseye-staging)

Debian PTSTrackerChangelogBugspackages.d.obuildd.d.o

Package(s): Suite:
Compact mode Co-maintainers

ArchitectureVersionStatusForBuilddStateMiscLogs
Buildd exposure stats armhf  6.0.24+dfsg-1Build-Attempted3d 21h 22mmb-lxc-02out-of-datemisc:optionalold | all (1)

Tail of log for proteinortho on armhf:

- maybe the fasta files are mixed nucleotide and aminoacid sequences or just not suited for diamond? (For example diamond only processes protein sequences) Try 'proteinortho --step=1 --check --force /path/to/fastas'.  

If you cannot solve this error, please send a report to incoming+paulklemm-phd-proteinortho-7278443-issue-@incoming.gitlab.com including the parameter-vector above or visit https://gitlab.com/paulklemm_PHD/proteinortho/wikis/Error%20Codes for more help.
Further more all mails to lechner@staff.uni-marburg.de are welcome


Perl exited with active threads:
	7 running and unjoined
	0 finished and unjoined
	0 running and detached
Error, could not open file test_diamond.proteinortho.tsv: No such file or directory at ./src/chk_test.pl line 6.
make[1]: *** [Makefile:266: test_step2] Error 2
make[1]: Leaving directory '/<<BUILDDIR>>/proteinortho-6.0.24+dfsg'
dh_auto_test: error: make -j4 test returned exit code 2
make: *** [debian/rules:10: binary-arch] Error 25