Raspbian Package Auto-Building

Buildd status for prboom (stretch-staging)

Debian PTSTrackerChangelogBugspackages.d.obuildd.d.o

Package(s): Suite:
Compact mode Co-maintainers

ArchitectureVersionStatusForBuilddStateMiscLogs
Buildd exposure stats armhf  2:2.5.0+dfsg1-6Build-Attempted905d 11h 39mbm-wb-02uncompiledgames:sourceold | all (2)

Tail of log for prboom on armhf:

                                           ^~~~~~~~~~~~~~~
Makefile:242: recipe for target 'i_sshot.o' failed
make[4]: *** [i_sshot.o] Error 1
make[4]: Leaving directory '/<<BUILDDIR>>/prboom-2.5.0+dfsg1/src/SDL'
Makefile:460: recipe for target 'all-recursive' failed
make[3]: *** [all-recursive] Error 1
make[3]: Leaving directory '/<<BUILDDIR>>/prboom-2.5.0+dfsg1/src'
Makefile:285: recipe for target 'all-recursive' failed
make[2]: *** [all-recursive] Error 1
make[2]: Leaving directory '/<<BUILDDIR>>/prboom-2.5.0+dfsg1'
Makefile:205: recipe for target 'all' failed
make[1]: *** [all] Error 2
make[1]: Leaving directory '/<<BUILDDIR>>/prboom-2.5.0+dfsg1'
debian/rules:26: recipe for target 'build-stamp' failed
make: *** [build-stamp] Error 2