Raspbian Package Auto-Building

Buildd status for postgresql-9.6 (stretch-staging)

Debian PTSTrackerChangelogBugspackages.d.obuildd.d.o

Package(s): Suite:
Compact mode Co-maintainers

ArchitectureVersionStatusForBuilddStateMiscLogs
Buildd exposure stats armhf  9.6.15-0+deb9u1Build-Attempted124d 11h 38mtest2019out-of-datemisc:sourceold | all (1)

Tail of log for postgresql-9.6 on armhf:

GNUmakefile:130: recipe for target 'check' failed
make[2]: *** [check] Error 2
make[2]: Leaving directory '/<<PKGBUILDDIR>>/build/src/test/regress'
Makefile:28: recipe for target 'check-regress-recurse' failed
make[1]: *** [check-regress-recurse] Error 2
make[1]: Leaving directory '/<<PKGBUILDDIR>>/build/src/test'
GNUmakefile:69: recipe for target 'check-world-src/test-recurse' failed
make: *** [check-world-src/test-recurse] Error 2
make: Leaving directory '/<<PKGBUILDDIR>>/build'
******** build/src/test/regress/regression.diffs ********
debian/rules:213: recipe for target 'override_dh_auto_test-arch' failed
make[1]: *** [override_dh_auto_test-arch] Error 1
make[1]: Leaving directory '/<<PKGBUILDDIR>>'
debian/rules:101: recipe for target 'build-arch' failed
make: *** [build-arch] Error 2