Raspbian Package Auto-Building

Buildd status for postgresql-9.4 (jessie-staging)

Debian PTSTrackerChangelogBugspackages.d.obuildd.d.o

Package(s): Suite:
Compact mode Co-maintainers

ArchitectureVersionStatusForBuilddStateMiscLogs
Buildd exposure stats armhf  9.4.25-0+deb8u1Build-Attempted23d 4h 14mbm-wb-03out-of-datemisc:sourceold | all (1)

Tail of log for postgresql-9.4 on armhf:

Failure, exiting
Makefile:30: recipe for target 'check' failed
make[4]: *** [check] Error 1
make[4]: Leaving directory '/<<PKGBUILDDIR>>/build/contrib/pg_upgrade'
Makefile:89: recipe for target 'check-pg_upgrade-recurse' failed
make[3]: *** [check-pg_upgrade-recurse] Error 2
make[3]: Leaving directory '/<<PKGBUILDDIR>>/build/contrib'
GNUmakefile:69: recipe for target 'check-world-contrib-recurse' failed
make[2]: *** [check-world-contrib-recurse] Error 2
make[2]: Leaving directory '/<<PKGBUILDDIR>>/build'
debian/rules:184: recipe for target 'override_dh_auto_test' failed
make[1]: *** [override_dh_auto_test] Error 1
make[1]: Leaving directory '/<<PKGBUILDDIR>>'
debian/rules:100: recipe for target 'build-arch' failed
make: *** [build-arch] Error 2