Raspbian Package Auto-Building

Buildd status for portslave (jessie-staging)

Debian PTSTrackerChangelogBugspackages.d.obuildd.d.o

Package(s): Suite:
Compact mode Co-maintainers

ArchitectureVersionStatusForBuilddStateMiscLogs
Buildd exposure stats armhf  2010.04.19.1Build-Attempted124d 20h 46mmb-lxc-01uncompiledcomm:sourceold | all (27)

Tail of log for portslave on armhf:

gcc -O2  -Wall -W -Wshadow -Wpointer-arith -Wwrite-strings -pedantic -I../ppp-2.4.1/pppd -DNO_CHAP -I/usr/include/pppd   -c -o rot_getty.o rot_getty.c
gcc -O2  -Wall -W -Wshadow -Wpointer-arith -Wwrite-strings -pedantic -I../ppp-2.4.1/pppd -DNO_CHAP -I/usr/include/pppd   -c -o spawnit.o spawnit.c
gcc -O2  -Wall -W -Wshadow -Wpointer-arith -Wwrite-strings -pedantic -I../ppp-2.4.1/pppd -DNO_CHAP -I/usr/include/pppd   -c -o slip.o slip.c
gcc -O2  -Wall -W -Wshadow -Wpointer-arith -Wwrite-strings -pedantic -I../ppp-2.4.1/pppd -DNO_CHAP -I/usr/include/pppd   -c -o ctlp-subs.o ctlp-subs.c
gcc -o portslave main.o getty.o rot_getty.o spawnit.o slip.o ctlp-subs.o -L. -lportslave
./libportslave.so: undefined reference to `crypt'
collect2: error: ld returned 1 exit status
Makefile:22: recipe for target 'portslave' failed
make[2]: *** [portslave] Error 1
make[2]: Leaving directory '/<<PKGBUILDDIR>>/src'
Makefile:24: recipe for target 'ALL' failed
make[1]: *** [ALL] Error 2
make[1]: Leaving directory '/<<PKGBUILDDIR>>'
debian/rules:25: recipe for target 'build-stamp' failed
make: *** [build-stamp] Error 2