Raspbian Package Auto-Building

Buildd status for pocl (bullseye-staging)

Debian PTSTrackerChangelogBugspackages.d.obuildd.d.o

Package(s): Suite:
Compact mode Co-maintainers

ArchitectureVersionStatusForBuilddStateMiscLogs
Buildd exposure stats armhf  1.5-6Build-Attempted70d 9h 50mtest2019uncompiledmisc:optionalold | all (1)

Tail of log for pocl on armhf:

- (arch=armel riscv64)_ZTVSt23_Sp_counted_ptr_inplaceIN5clang22PCHContainerOperationsESaIS1_ELN9__gnu_cxx12_Lock_policyE1EE@Base 0.12-5~llvm3.7
- (arch=!armel !riscv64)_ZTVSt23_Sp_counted_ptr_inplaceIN5clang22PCHContainerOperationsESaIS1_ELN9__gnu_cxx12_Lock_policyE2EE@Base 0.12-5~llvm3.7
+ _ZTVSt23_Sp_counted_ptr_inplaceIN4llvm3sys2fs6detail12DirIterStateESaIS4_ELN9__gnu_cxx12_Lock_policyE1EE@Base 0.14-7~llvm4.0
+#MISSING: 1.5-6# (arch=!armel !riscv64)_ZTVSt23_Sp_counted_ptr_inplaceIN4llvm3sys2fs6detail12DirIterStateESaIS4_ELN9__gnu_cxx12_Lock_policyE2EE@Base 0.14-7~llvm4.0
+ _ZTVSt23_Sp_counted_ptr_inplaceIN4llvm3sys2fs6detail15RecDirIterStateESaIS4_ELN9__gnu_cxx12_Lock_policyE1EE@Base 0.14-7~llvm4.0
+#MISSING: 1.5-6# (arch=!armel !riscv64)_ZTVSt23_Sp_counted_ptr_inplaceIN4llvm3sys2fs6detail15RecDirIterStateESaIS4_ELN9__gnu_cxx12_Lock_policyE2EE@Base 0.14-7~llvm4.0
+ _ZTVSt23_Sp_counted_ptr_inplaceIN5clang22PCHContainerOperationsESaIS1_ELN9__gnu_cxx12_Lock_policyE1EE@Base 0.12-5~llvm3.7
+#MISSING: 1.5-6# (arch=!armel !riscv64)_ZTVSt23_Sp_counted_ptr_inplaceIN5clang22PCHContainerOperationsESaIS1_ELN9__gnu_cxx12_Lock_policyE2EE@Base 0.12-5~llvm3.7
  _ZZNSt19_Sp_make_shared_tag5_S_tiEvE5__tag@Base 1.1-8~llvm6.0+gcc8.2
 #MISSING: 0.14# check_compiler_cache@Base 0.10
  clGetExtensionFunctionAddress@Base 0.10
dh_makeshlibs: error: failing due to earlier errors
make[1]: *** [debian/rules:104: run_dh_makeshlibs] Error 25
make[1]: Leaving directory '/<<PKGBUILDDIR>>'
make: *** [debian/rules:53: binary-arch] Error 2