Raspbian Package Auto-Building

Buildd status for pinot (stretch-staging)

Debian PTSTrackerChangelogBugspackages.d.obuildd.d.o

Package(s): Suite:
Compact mode Co-maintainers

ArchitectureVersionStatusForBuilddStateMiscLogs
Buildd exposure stats armhf  1.05-1.2Build-Attempted902d 13h 24mbm-wb-03uncompiledx11:sourceold | all (6)

Tail of log for pinot on armhf:

                                           ^~~~~~~~~~~~~~~~
DownloaderInterface.cpp:108:27: error: 'locksTable' was not declared in this scope
   pthread_mutex_destroy(&(locksTable[lockNum]));
                           ^~~~~~~~~~
Makefile:549: recipe for target 'libCollect_la-DownloaderInterface.lo' failed
make[3]: *** [libCollect_la-DownloaderInterface.lo] Error 1
make[3]: Leaving directory '/<<PKGBUILDDIR>>/Collect'
Makefile:559: recipe for target 'all-recursive' failed
make[2]: *** [all-recursive] Error 1
make[2]: Leaving directory '/<<PKGBUILDDIR>>'
Makefile:446: recipe for target 'all' failed
make[1]: *** [all] Error 2
make[1]: Leaving directory '/<<PKGBUILDDIR>>'
/usr/share/cdbs/1/class/makefile.mk:77: recipe for target 'debian/stamp-makefile-build' failed
make: *** [debian/stamp-makefile-build] Error 2