Raspbian Package Auto-Building

Buildd status for php-apc (stretch-staging)

Debian PTSTrackerChangelogBugspackages.d.obuildd.d.o

Package(s): Suite:
Compact mode Co-maintainers

ArchitectureVersionStatusForBuilddStateMiscLogs
Buildd exposure stats armhf  3.1.13-1Build-Attempted907d 2h 56mbm-wb-02uncompiledphp:sourceold | all (2)

Tail of log for php-apc on armhf:

libtool: compile:  cc -I. -I/<<PKGBUILDDIR>>/APC-3.1.13 -DPHP_ATOM_INC -I/<<PKGBUILDDIR>>/APC-3.1.13/include -I/<<PKGBUILDDIR>>/APC-3.1.13/main -I/<<PKGBUILDDIR>>/APC-3.1.13 -I/usr/include/php5 -I/usr/include/php5/main -I/usr/include/php5/TSRM -I/usr/include/php5/Zend -I/usr/include/php5/ext -I/usr/include/php5/ext/date/lib -D_LARGEFILE_SOURCE -D_FILE_OFFSET_BITS=64 -DHAVE_CONFIG_H -g -O2 -c /<<PKGBUILDDIR>>/APC-3.1.13/apc_cache.c  -fPIC -DPIC -o .libs/apc_cache.o
/<<PKGBUILDDIR>>/APC-3.1.13/apc_cache.c: In function '_apc_cache_user_update':
/<<PKGBUILDDIR>>/APC-3.1.13/apc_cache.c:818:63: error: 'IS_CONSTANT_INDEX' undeclared (first use in this function)
             switch(Z_TYPE_P((*slot)->value->data.user.val) & ~IS_CONSTANT_INDEX) {
                                                               ^~~~~~~~~~~~~~~~~
/<<PKGBUILDDIR>>/APC-3.1.13/apc_cache.c:818:63: note: each undeclared identifier is reported only once for each function it appears in
/<<PKGBUILDDIR>>/APC-3.1.13/apc_cache.c:820:22: error: 'IS_CONSTANT_ARRAY' undeclared (first use in this function)
                 case IS_CONSTANT_ARRAY:
                      ^~~~~~~~~~~~~~~~~
Makefile:186: recipe for target 'apc_cache.lo' failed
make[1]: *** [apc_cache.lo] Error 1
make[1]: Leaving directory '/<<PKGBUILDDIR>>/APC-3.1.13'
cp: cannot stat 'modules/*': No such file or directory
debian/rules:48: recipe for target 'build-stamp' failed
make: *** [build-stamp] Error 1