Raspbian Package Auto-Building

Buildd status for photoflow (bullseye-staging)

Debian PTSTrackerChangelogBugspackages.d.obuildd.d.o

Package(s): Suite:
Compact mode Co-maintainers

ArchitectureVersionStatusForBuilddStateMiscLogs
Buildd exposure stats armhf  0.2.8+git20200114-1Build-Attempted72d 16h 39mbm-wb-01uncompiledmisc:sourceold | all (5)

Tail of log for photoflow on armhf:

c++: error: unrecognized command-line option '-mno-sse3'
cd /<<BUILDDIR>>/photoflow-0.2.8+git20200114/obj-arm-linux-gnueabihf/src && /usr/bin/c++  -DLENSFUN_HAS_OVERLOADED_FIND_LENSES=1 -DVIPS_GET_BLOB_REQUIRES_CONST_VOID_POINTER=1 -I/usr/include/gtkmm-2.4 -I/usr/lib/arm-linux-gnueabihf/gtkmm-2.4/include -I/usr/include/atkmm-1.6 -I/usr/include/gtk-unix-print-2.0 -I/usr/include/gtk-2.0 -I/usr/include/gdkmm-2.4 -I/usr/lib/arm-linux-gnueabihf/gdkmm-2.4/include -I/usr/include/giomm-2.4 -I/usr/lib/arm-linux-gnueabihf/giomm-2.4/include -I/usr/include/pangomm-1.4 -I/usr/lib/arm-linux-gnueabihf/pangomm-1.4/include -I/usr/include/glibmm-2.4 -I/usr/lib/arm-linux-gnueabihf/glibmm-2.4/include -I/usr/include/cairomm-1.0 -I/usr/lib/arm-linux-gnueabihf/cairomm-1.0/include -I/usr/include/sigc++-2.0 -I/usr/lib/arm-linux-gnueabihf/sigc++-2.0/include -I/usr/lib/arm-linux-gnueabihf/gtk-2.0/include -I/usr/include/pango-1.0 -I/usr/include/atk-1.0 -I/usr/include/gdk-pixbuf-2.0 -I/usr/include/libmount -I/usr/include/blkid -I/usr/include/fribidi -I/usr/include/cairo -I/usr/include/pixman-1 -I/usr/include/harfbuzz -I/usr/include/glib-2.0 -I/usr/lib/arm-linux-gnueabihf/glib-2.0/include -I/usr/include/uuid -I/usr/include/freetype2 -I/usr/include/libpng16 -I/<<BUILDDIR>>/photoflow-0.2.8+git20200114/src/external -I/usr/include/OpenEXR -I/usr/include/libxml2 -I/usr/include/orc-0.4 -I/usr/include/libgsf-1 -I/usr/include/arm-linux-gnueabihf/ImageMagick-6 -I/usr/include/ImageMagick-6 -I/usr/include/poppler/glib -I/usr/include/poppler -I/usr/include/librsvg-2.0 -I/usr/include/openslide -I/usr/lib/arm-linux-gnueabihf/hdf5/serial/include -I/<<BUILDDIR>>/photoflow-0.2.8+git20200114/src -I/<<BUILDDIR>>/photoflow-0.2.8+git20200114/src/external/rawspeed/src/librawspeed -I/<<BUILDDIR>>/photoflow-0.2.8+git20200114/src/external/rawspeed/src/external -I/<<BUILDDIR>>/photoflow-0.2.8+git20200114/obj-arm-linux-gnueabihf/src/external/rawspeed/src -I/usr/include/lensfun -I/<<BUILDDIR>>/photoflow-0.2.8+git20200114/src/external/librtprocess/src/include  -g -O2 -fdebug-prefix-map=/<<BUILDDIR>>/photoflow-0.2.8+git20200114=. -fstack-protector-strong -Wformat -Werror=format-security -Wdate-time -D_FORTIFY_SOURCE=2 -DPF_HAS_LENSFUN   -O3 -ftree-vectorize -funroll-loops -fomit-frame-pointer -DNDEBUG  -std=gnu++14 -march=nocona -mno-sse3 -mtune=generic -Wno-error=narrowing -Dgmic_build -Dcimg_use_vt100 -Dgmic_is_parallel -Dcimg_use_fftw3 -Dcimg_use_tiff -Dcimg_use_zlib -Dcimg_display=0 -fno-ipa-sra -fpermissive -I/<<BUILDDIR>>/photoflow-0.2.8+git20200114/src/dt -DLIBRAW_NODLL -DINSTALL_PREFIX='"/usr"'  -Wno-deprecated-register -Wno-deprecated-declarations -DLOCALEDIR="/usr/share/locale" -DGTKMM_2  -Wno-unused-parameter -fPIC   -o CMakeFiles/pfgui.dir/gui/histogram.cc.o -c /<<BUILDDIR>>/photoflow-0.2.8+git20200114/src/gui/histogram.cc
make[3]: *** [src/CMakeFiles/pfgui.dir/build.make:92: src/CMakeFiles/pfgui.dir/gui/help.cc.o] Error 1
c++: error: unrecognized -march target: nocona
c++: note: valid arguments are: armv4 armv4t armv5t armv5te armv5tej armv6 armv6j armv6k armv6z armv6kz armv6zk armv6t2 armv6-m armv6s-m armv7 armv7-a armv7ve armv7-r armv7-m armv7e-m armv8-a armv8.1-a armv8.2-a armv8.3-a armv8.4-a armv8.5-a armv8.6-a armv8-m.base armv8-m.main armv8-r armv8.1-m.main iwmmxt iwmmxt2 native
c++: error: missing argument to '-march='
c++: error: unrecognized command-line option '-mno-sse3'
make[3]: *** [src/CMakeFiles/pfgui.dir/build.make:105: src/CMakeFiles/pfgui.dir/gui/histogram.cc.o] Error 1
make[3]: Leaving directory '/<<BUILDDIR>>/photoflow-0.2.8+git20200114/obj-arm-linux-gnueabihf'
make[2]: *** [CMakeFiles/Makefile2:686: src/CMakeFiles/pfgui.dir/all] Error 2
make[2]: Leaving directory '/<<BUILDDIR>>/photoflow-0.2.8+git20200114/obj-arm-linux-gnueabihf'
make[1]: *** [Makefile:133: all] Error 2
make[1]: Leaving directory '/<<BUILDDIR>>/photoflow-0.2.8+git20200114/obj-arm-linux-gnueabihf'
dh_auto_build: error: cd obj-arm-linux-gnueabihf && make -j4 "INSTALL=install --strip-program=true" returned exit code 2
make: *** [debian/rules:14: build-arch] Error 25