Raspbian Package Auto-Building

Buildd status for perftest (stretch-staging)

Debian PTSTrackerChangelogBugspackages.d.obuildd.d.o

Package(s): Suite:
Compact mode Co-maintainers

ArchitectureVersionStatusForBuilddStateMiscLogs
Buildd exposure stats armhf  3.4+0.6.gc3435c2-1Build-Attempted902d 14h 10mbm-wb-03uncompilednet:sourceold | all (6)

Tail of log for perftest on armhf:

 #warning get_cycles not implemented for this architecture: attempt asm/timex.h
  ^~~~~~~
src/get_clock.h:102:23: fatal error: asm/timex.h: No such file or directory
 #include <asm/timex.h>
                       ^
compilation terminated.
Makefile:786: recipe for target 'src/get_clock.o' failed
make[2]: *** [src/get_clock.o] Error 1
make[2]: Leaving directory '/<<BUILDDIR>>/perftest-3.4+0.6.gc3435c2'
Makefile:526: recipe for target 'all' failed
make[1]: *** [all] Error 2
make[1]: Leaving directory '/<<BUILDDIR>>/perftest-3.4+0.6.gc3435c2'
dh_auto_build: make -j1 returned exit code 2
debian/rules:7: recipe for target 'build-arch' failed
make: *** [build-arch] Error 2