Raspbian Package Auto-Building

Buildd status for perftest (buster-staging)

Debian PTSTrackerChangelogBugspackages.d.obuildd.d.o

Package(s): Suite:
Compact mode Co-maintainers

ArchitectureVersionStatusForBuilddStateMiscLogs
Buildd exposure stats armhf  4.4+0.5-1Build-Attempted166d 7h 21mtest2019uncompilednet:sourceold | all (17)

Tail of log for perftest on armhf:

                 from src/perftest_communication.h:45,
                 from src/perftest_communication.c:17:
src/get_clock.h:109:2: warning: #warning get_cycles not implemented for this architecture: attempt asm/timex.h [-Wcpp]
 #warning get_cycles not implemented for this architecture: attempt asm/timex.h
  ^~~~~~~
src/get_clock.h:110:10: fatal error: asm/timex.h: No such file or directory
 #include <asm/timex.h>
          ^~~~~~~~~~~~~
compilation terminated.
make[2]: *** [Makefile:844: src/perftest_communication.o] Error 1
make[2]: Leaving directory '/<<BUILDDIR>>/perftest-4.4+0.5'
make[1]: *** [Makefile:571: all] Error 2
make[1]: Leaving directory '/<<BUILDDIR>>/perftest-4.4+0.5'
dh_auto_build: make -j4 returned exit code 2
make: *** [debian/rules:7: build-arch] Error 2