Raspbian Package Auto-Building

Buildd status for pencil2d (bullseye-staging)

Debian PTSTrackerChangelogBugspackages.d.obuildd.d.o

Package(s): Suite:
Compact mode Co-maintainers

ArchitectureVersionStatusForBuilddStateMiscLogs
Buildd exposure stats armhf  0.6.5-2Build-Attempted63d 20h 23mbm-wb-04out-of-datemisc:optionalold | all (1)

Tail of log for pencil2d on armhf:

  426 |       vector<_Tp, _Alloc>::
      |       ^~~~~~~~~~~~~~~~~~~
/usr/include/c++/10/bits/vector.tcc:426:7: note: parameter passing for argument of type 'std::vector<Catch::SectionEndInfo>::iterator' changed in GCC 7.1
In file included from /usr/include/c++/10/vector:67,
                 from src/catch.hpp:465,
                 from src/main.cpp:18:
/usr/include/c++/10/bits/stl_vector.h: In member function 'virtual void Catch::RunContext::sectionEndedEarly(const Catch::SectionEndInfo&)':
/usr/include/c++/10/bits/stl_vector.h:1198:21: note: parameter passing for argument of type '__gnu_cxx::__normal_iterator<Catch::SectionEndInfo*, std::vector<Catch::SectionEndInfo> >' changed in GCC 7.1
 1198 |    _M_realloc_insert(end(), __x);
      |    ~~~~~~~~~~~~~~~~~^~~~~~~~~~~~
make[2]: Leaving directory '/<<PKGBUILDDIR>>/tests'
make[1]: *** [Makefile:135: sub-tests-make_first-ordered] Error 2
make[1]: Leaving directory '/<<PKGBUILDDIR>>'
dh_auto_build: error: make -j4 returned exit code 2
make: *** [debian/rules:17: binary-arch] Error 25