Raspbian Package Auto-Building

Buildd status for pbseqlib (bullseye-staging)

Debian PTSTrackerChangelogBugspackages.d.obuildd.d.o

Package(s): Suite:
Compact mode Co-maintainers

ArchitectureVersionStatusForBuilddStateMiscLogs
Buildd exposure stats armhf  5.3.3+dfsg-4Build-Attempted73d 8h 17mtest2019uncompiledmisc:optionalold | all (7)

Tail of log for pbseqlib on armhf:

                 from ../alignment/algorithms/anchoring/BWTSearch.hpp:6,
                 from ../alignment/algorithms/anchoring/BWTSearch.cpp:1:
../alignment/suffixarray/SuffixArray.hpp: In member function ‘void SuffixArray<T, Sigma, Compare, Tuple>::LarssonBuildSuffixArray(T*, SAIndexLength, Sigma&)’:
../alignment/suffixarray/SuffixArray.hpp:288:44: error: narrowing conversion of ‘4294967295’ from ‘unsigned int’ to ‘long int’ [-Wnarrowing]
  288 |         LarssonSuffixSort<SAIndex, UINT_MAX> sorter;
      |                                            ^
../alignment/suffixarray/SuffixArray.hpp:289:84: error: ‘sorter’ cannot be used as a function
  289 |         sorter(index, p, ((SAIndex)targetLength), ((SAIndex)maxVal + 1), (SAIndex)1);
      |                                                                                    ^
[44/186] c++ -Iblasr@sha -I. -I.. -I/usr/include -I/usr/include/hdf5/serial -fdiagnostics-color=always -pipe -D_FILE_OFFSET_BITS=64 -std=c++11 -g -O2 -fdebug-prefix-map=/<<BUILDDIR>>/pbseqlib-5.3.3+dfsg=. -fstack-protector-strong -Wformat -Werror=format-security -O3 -std=c++14 -Wdate-time -D_FORTIFY_SOURCE=2 -DHAVE_HDF5_1_10_1 -O3 -fPIC -DBOOST_ALL_NO_LIB -Wno-delete-non-virtual-dtor -Wno-unused-variable -Wno-non-virtual-dtor -MD -MQ 'blasr@sha/alignment_algorithms_anchoring_FindMaxInterval.cpp.o' -MF 'blasr@sha/alignment_algorithms_anchoring_FindMaxInterval.cpp.o.d' -o 'blasr@sha/alignment_algorithms_anchoring_FindMaxInterval.cpp.o' -c ../alignment/algorithms/anchoring/FindMaxInterval.cpp
[45/186] c++ -Iblasr@sha -I. -I.. -I/usr/include -I/usr/include/hdf5/serial -fdiagnostics-color=always -pipe -D_FILE_OFFSET_BITS=64 -std=c++11 -g -O2 -fdebug-prefix-map=/<<BUILDDIR>>/pbseqlib-5.3.3+dfsg=. -fstack-protector-strong -Wformat -Werror=format-security -O3 -std=c++14 -Wdate-time -D_FORTIFY_SOURCE=2 -DHAVE_HDF5_1_10_1 -O3 -fPIC -DBOOST_ALL_NO_LIB -Wno-delete-non-virtual-dtor -Wno-unused-variable -Wno-non-virtual-dtor -MD -MQ 'blasr@sha/alignment_algorithms_sorting_MultikeyQuicksort.cpp.o' -MF 'blasr@sha/alignment_algorithms_sorting_MultikeyQuicksort.cpp.o.d' -o 'blasr@sha/alignment_algorithms_sorting_MultikeyQuicksort.cpp.o' -c ../alignment/algorithms/sorting/MultikeyQuicksort.cpp
[46/186] c++ -Iblasr@sha -I. -I.. -I/usr/include -I/usr/include/hdf5/serial -fdiagnostics-color=always -pipe -D_FILE_OFFSET_BITS=64 -std=c++11 -g -O2 -fdebug-prefix-map=/<<BUILDDIR>>/pbseqlib-5.3.3+dfsg=. -fstack-protector-strong -Wformat -Werror=format-security -O3 -std=c++14 -Wdate-time -D_FORTIFY_SOURCE=2 -DHAVE_HDF5_1_10_1 -O3 -fPIC -DBOOST_ALL_NO_LIB -Wno-delete-non-virtual-dtor -Wno-unused-variable -Wno-non-virtual-dtor -MD -MQ 'blasr@sha/alignment_algorithms_sorting_LightweightSuffixArray.cpp.o' -MF 'blasr@sha/alignment_algorithms_sorting_LightweightSuffixArray.cpp.o.d' -o 'blasr@sha/alignment_algorithms_sorting_LightweightSuffixArray.cpp.o' -c ../alignment/algorithms/sorting/LightweightSuffixArray.cpp
ninja: build stopped: subcommand failed.
dh_auto_build: error: cd obj-arm-linux-gnueabihf && LC_ALL=C.UTF-8 ninja -j4 -v returned exit code 1
make: *** [debian/rules:25: build-arch] Error 25