Raspbian Package Auto-Building

Buildd status for patchelf (jessie-staging)

Debian PTSTrackerChangelogBugspackages.d.obuildd.d.o

Package(s): Suite:
Compact mode Co-maintainers

ArchitectureVersionStatusForBuilddStateMiscLogs
Buildd exposure stats armhf  0.8-2Build-Attempted124d 20h 32mbm-wb-04uncompiledmisc:sourceold | all (15)

Tail of log for patchelf on armhf:

Makefile:700: recipe for target 'test-suite.log' failed
make[4]: *** [test-suite.log] Error 1
make[4]: Leaving directory '/<<PKGBUILDDIR>>/tests'
Makefile:806: recipe for target 'check-TESTS' failed
make[3]: *** [check-TESTS] Error 2
make[3]: Leaving directory '/<<PKGBUILDDIR>>/tests'
Makefile:935: recipe for target 'check-am' failed
make[2]: *** [check-am] Error 2
make[2]: Leaving directory '/<<PKGBUILDDIR>>/tests'
Makefile:427: recipe for target 'check-recursive' failed
make[1]: *** [check-recursive] Error 1
make[1]: Leaving directory '/<<PKGBUILDDIR>>'
dh_auto_test: make -j1 check returned exit code 2
debian/rules:8: recipe for target 'build-arch' failed
make: *** [build-arch] Error 2