Raspbian Package Auto-Building

Buildd status for p4est (bullseye-staging)

Debian PTSTrackerChangelogBugspackages.d.obuildd.d.o

Package(s): Suite:
Compact mode Co-maintainers

ArchitectureVersionStatusForBuilddStateMiscLogs
Buildd exposure stats armhf  2.2-3Build-Attempted9d 1h 45mtestwandboardout-of-datemisc:optionalold | all (4)

Tail of log for p4est on armhf:

# ERROR: 0
============================================================================
See ./test-suite.log
Please report to info@p4est.org
============================================================================
make[4]: *** [Makefile:3867: test-suite.log] Error 1
make[4]: Leaving directory '/<<PKGBUILDDIR>>'
make[3]: *** [Makefile:3975: check-TESTS] Error 2
make[3]: Leaving directory '/<<PKGBUILDDIR>>'
make[2]: *** [Makefile:4609: check-am] Error 2
make[2]: Leaving directory '/<<PKGBUILDDIR>>'
make[1]: *** [Makefile:3752: check-recursive] Error 1
make[1]: Leaving directory '/<<PKGBUILDDIR>>'
dh_auto_test: make -j4 check VERBOSE=1 returned exit code 2
make: *** [debian/rules:9: binary-arch] Error 255