Raspbian Package Auto-Building

Buildd status for ostree (bullseye-staging)

Debian PTSTrackerChangelogBugspackages.d.obuildd.d.o

Package(s): Suite:
Compact mode Co-maintainers

ArchitectureVersionStatusForBuilddStateMiscLogs
Buildd exposure stats armhf  2020.7-1Build-Attempted9d 14h 8mmb-lxc-01out-of-datemisc:optionalold | all (1)

Tail of log for ostree on armhf:

Please report to walters@verbum.org
============================================================================
make[6]: *** [Makefile:7773: test-suite.log] Error 1
make[6]: Leaving directory '/<<PKGBUILDDIR>>'
make[5]: *** [Makefile:7881: check-TESTS] Error 2
make[5]: Leaving directory '/<<PKGBUILDDIR>>'
make[4]: *** [Makefile:8991: check-am] Error 2
make[4]: Leaving directory '/<<PKGBUILDDIR>>'
make[3]: *** [Makefile:7658: check-recursive] Error 1
make[3]: Leaving directory '/<<PKGBUILDDIR>>'
make[2]: *** [Makefile:8994: check] Error 2
make[2]: Leaving directory '/<<PKGBUILDDIR>>'
make[1]: *** [debian/rules:48: override_dh_auto_test-arch] Error 1
make[1]: Leaving directory '/<<PKGBUILDDIR>>'
make: *** [debian/rules:8: binary-arch] Error 2