Raspbian Package Auto-Building

Buildd status for openmm (bullseye-staging)

Debian PTSTrackerChangelogBugspackages.d.obuildd.d.o

Package(s): Suite:
Compact mode Co-maintainers

ArchitectureVersionStatusForBuilddStateMiscLogs
Buildd exposure stats armhf  7.4.0.491.gac5a8f71+dfsg-1Build-Attempted72d 14h 40mtestbuildduncompiledmisc:extraold | all (2)

Tail of log for openmm on armhf:

In file included from /<<BUILDDIR>>/openmm-7.4.0.491.gac5a8f71+dfsg/libraries/vecmath/src/vecmath.cpp:2:
/<<BUILDDIR>>/openmm-7.4.0.491.gac5a8f71+dfsg/libraries/vecmath/include/neon_mathfun.h:53:25: note: called from here
   53 |   v4sf one = vdupq_n_f32(1);
      |              ~~~~~~~~~~~^~~
make[4]: *** [CMakeFiles/OpenMM.dir/build.make:2523: CMakeFiles/OpenMM.dir/libraries/vecmath/src/vecmath.cpp.o] Error 1
make[4]: *** Waiting for unfinished jobs....
make[4]: Leaving directory '/<<BUILDDIR>>/openmm-7.4.0.491.gac5a8f71+dfsg/obj-arm-linux-gnueabihf'
make[3]: *** [CMakeFiles/Makefile2:1393: CMakeFiles/OpenMM.dir/all] Error 2
make[3]: Leaving directory '/<<BUILDDIR>>/openmm-7.4.0.491.gac5a8f71+dfsg/obj-arm-linux-gnueabihf'
make[2]: *** [Makefile:144: all] Error 2
make[2]: Leaving directory '/<<BUILDDIR>>/openmm-7.4.0.491.gac5a8f71+dfsg/obj-arm-linux-gnueabihf'
dh_auto_build: error: cd obj-arm-linux-gnueabihf && make -j4 "INSTALL=install --strip-program=true" returned exit code 2
make[1]: *** [debian/rules:31: override_dh_auto_build] Error 25
make[1]: Leaving directory '/<<BUILDDIR>>/openmm-7.4.0.491.gac5a8f71+dfsg'
make: *** [debian/rules:25: binary-arch] Error 2