Raspbian Package Auto-Building

Buildd status for openldap (stretch-staging)

Debian PTSTrackerChangelogBugspackages.d.obuildd.d.o

Package(s): Suite:
Compact mode Co-maintainers

ArchitectureVersionStatusForBuilddStateMiscLogs
Buildd exposure stats armhf  2.4.44+dfsg-5+deb9u3Build-Attempted94d 12h 7mbm-wb-04out-of-datenet:sourceold | all (1)

Tail of log for openldap on armhf:

Makefile:312: recipe for target 'mdb-mod' failed
make[4]: *** [mdb-mod] Error 1
make[4]: Leaving directory '/<<BUILDDIR>>/openldap-2.4.44+dfsg/debian/build/tests'
Makefile:282: recipe for target 'test' failed
make[3]: *** [test] Error 2
make[3]: Leaving directory '/<<BUILDDIR>>/openldap-2.4.44+dfsg/debian/build/tests'
Makefile:294: recipe for target 'test' failed
make[2]: *** [test] Error 2
make[2]: Leaving directory '/<<BUILDDIR>>/openldap-2.4.44+dfsg/debian/build'
dh_auto_test: make -j4 test VERBOSE=1 returned exit code 2
debian/rules:117: recipe for target 'override_dh_auto_test' failed
make[1]: *** [override_dh_auto_test] Error 2
make[1]: Leaving directory '/<<BUILDDIR>>/openldap-2.4.44+dfsg'
debian/rules:69: recipe for target 'build-arch' failed
make: *** [build-arch] Error 2