Raspbian Package Auto-Building

Buildd status for openldap (jessie-staging)

Debian PTSTrackerChangelogBugspackages.d.obuildd.d.o

Package(s): Suite:
Compact mode Co-maintainers

ArchitectureVersionStatusForBuilddStateMiscLogs
Buildd exposure stats armhf  2.4.40+dfsg-1+deb8u5Build-Attempted30d 9h 29mbm-wb-01out-of-datenet:sourceold | all (1)

Tail of log for openldap on armhf:

Comparison failed
>>>>> test046-dds failed for mdb
(exit 1)
Makefile:312: recipe for target 'mdb-mod' failed
make[3]: *** [mdb-mod] Error 1
make[3]: Leaving directory '/<<BUILDDIR>>/openldap-2.4.40+dfsg/debian/build/tests'
Makefile:282: recipe for target 'test' failed
make[2]: *** [test] Error 2
make[2]: Leaving directory '/<<BUILDDIR>>/openldap-2.4.40+dfsg/debian/build/tests'
Makefile:294: recipe for target 'test' failed
make[1]: *** [test] Error 2
make[1]: Leaving directory '/<<BUILDDIR>>/openldap-2.4.40+dfsg/debian/build'
dh_auto_test: make -j4 test returned exit code 2
debian/rules:54: recipe for target 'build-arch' failed
make: *** [build-arch] Error 2