Raspbian Package Auto-Building

Buildd status for openjfx (stretch-staging)

Debian PTSTrackerChangelogBugspackages.d.obuildd.d.o

Package(s): Suite:
Compact mode Co-maintainers

ArchitectureVersionStatusForBuilddStateMiscLogs
Buildd exposure stats armhf  8u141-b14-3~deb9u1Build-Attempted784d 12h 12mmb-lxc-01out-of-datemisc:sourceold | all (1)

Tail of log for openjfx on armhf:

	at org.gradle.api.internal.tasks.execution.ExecuteActionsTaskExecuter.executeAction(ExecuteActionsTaskExecuter.java:95)
	at org.gradle.api.internal.tasks.execution.ExecuteActionsTaskExecuter.executeActions(ExecuteActionsTaskExecuter.java:76)
	... 58 more


BUILD FAILED

Total time: 1 hrs 52 mins 13.567 secs
Stopped 0 compiler daemon(s).
dh_auto_build: gradle --info --console plain --offline --stacktrace --no-daemon --refresh-dependencies --gradle-user-home .gradle -Duser.home=. -Duser.name=debian -Ddebian.package=openjfx sdk -x javadoc -x src returned exit code 1
debian/rules:32: recipe for target 'override_dh_auto_build-arch' failed
make[1]: *** [override_dh_auto_build-arch] Error 25
make[1]: Leaving directory '/<<PKGBUILDDIR>>'
debian/rules:26: recipe for target 'build-arch' failed
make: *** [build-arch] Error 2