Raspbian Package Auto-Building

Buildd status for olive-editor (bullseye-staging)

Debian PTSTrackerChangelogBugspackages.d.obuildd.d.o

Package(s): Suite:
Compact mode Co-maintainers

ArchitectureVersionStatusForBuilddStateMiscLogs
Buildd exposure stats armhf  20191111-1Build-Attempted10d 5h 46mbm-wb-02uncompiledmisc:extraold | all (2)

Tail of log for olive-editor on armhf:

/<<PKGBUILDDIR>>/effects/internal/shakeeffect.cpp: In member function 'virtual void ShakeEffect::process_coords(double, GLTextureCoords&, int)':
/<<PKGBUILDDIR>>/effects/internal/shakeeffect.cpp:91:3: error: 'glRotatef' was not declared in this scope
   91 |   glRotatef(rotoff, 0, 0, 1);
      |   ^~~~~~~~~
[ 39%] Building CXX object CMakeFiles/olive-editor.dir/effects/internal/timecodeeffect.cpp.o
/usr/bin/c++  -DGITHASH=\"\" -DQT_CORE_LIB -DQT_DEPRECATED_WARNINGS -DQT_GUI_LIB -DQT_MULTIMEDIA_LIB -DQT_NETWORK_LIB -DQT_NO_DEBUG -DQT_OPENGL_LIB -DQT_SVG_LIB -DQT_WIDGETS_LIB -I/<<PKGBUILDDIR>>/obj-arm-linux-gnueabihf -I/<<PKGBUILDDIR>> -I/<<PKGBUILDDIR>>/obj-arm-linux-gnueabihf/olive-editor_autogen/include -isystem /usr/include/arm-linux-gnueabihf/qt5 -isystem /usr/include/arm-linux-gnueabihf/qt5/QtCore -isystem /usr/lib/arm-linux-gnueabihf/qt5/mkspecs/linux-g++ -isystem /usr/include/arm-linux-gnueabihf/qt5/QtGui -isystem /usr/include/arm-linux-gnueabihf/qt5/QtWidgets -isystem /usr/include/arm-linux-gnueabihf/qt5/QtMultimedia -isystem /usr/include/arm-linux-gnueabihf/qt5/QtNetwork -isystem /usr/include/arm-linux-gnueabihf/qt5/QtOpenGL -isystem /usr/include/arm-linux-gnueabihf/qt5/QtSvg -isystem /usr/include/arm-linux-gnueabihf  -g -O2 -fdebug-prefix-map=/<<PKGBUILDDIR>>=. -fstack-protector-strong -Wformat -Werror=format-security -Wdate-time -D_FORTIFY_SOURCE=2   -fPIC -std=c++11 -o CMakeFiles/olive-editor.dir/effects/internal/timecodeeffect.cpp.o -c /<<PKGBUILDDIR>>/effects/internal/timecodeeffect.cpp
make[3]: *** [CMakeFiles/olive-editor.dir/build.make:677: CMakeFiles/olive-editor.dir/effects/internal/shakeeffect.cpp.o] Error 1
make[3]: *** Waiting for unfinished jobs....
make[3]: Leaving directory '/<<PKGBUILDDIR>>/obj-arm-linux-gnueabihf'
make[2]: *** [CMakeFiles/Makefile2:76: CMakeFiles/olive-editor.dir/all] Error 2
make[2]: Leaving directory '/<<PKGBUILDDIR>>/obj-arm-linux-gnueabihf'
make[1]: *** [Makefile:133: all] Error 2
make[1]: Leaving directory '/<<PKGBUILDDIR>>/obj-arm-linux-gnueabihf'
dh_auto_build: cd obj-arm-linux-gnueabihf && make -j4 "INSTALL=install --strip-program=true" returned exit code 2
make: *** [debian/rules:17: build-arch] Error 255