Raspbian Package Auto-Building

Buildd status for selected packages (buster-staging)

Bugs

Package(s): Suite:
Compact mode Co-maintainers

Package armhf
Buildd exposure stats
✘ oclgrind  Build-Attempted
✔ libsoundioBuild-Attempted
✔ mingw32-binutilsBuild-Attempted
✔ cryptominisatBuild-Attempted
✔ haskell-heterocephalusBuild-Attempted
✔ libmlx5Build-Attempted
✔ libtangoBuild-Attempted
✔ mensisBuild-Attempted
✔ osrmBuild-Attempted
✔ valentinaBuild-Attempted
✘ mariadb-10.3  Build-Attempted

Tail of log for oclgrind on armhf:

96% tests passed, 4 tests failed out of 96

Total Test time (real) =  51.21 sec

The following tests FAILED:
	 54 - interactive/struct_member (Failed)
	 68 - misc/lvalue_loads (Failed)
	 79 - uninitialized/partially_uninitialized_fract (Failed)
	 80 - uninitialized/private_array_initializer_list (Failed)
Errors while running CTest
make[1]: *** [Makefile:88: test] Error 8
make[1]: Leaving directory '/<<PKGBUILDDIR>>/obj-arm-linux-gnueabihf'
dh_auto_test: cd obj-arm-linux-gnueabihf && make -j4 test ARGS\+=-j4 returned exit code 2
make: *** [debian/rules:13: build-arch] Error 2

Tail of log for libsoundio on armhf:

                                                            ^
In file included from /<<PKGBUILDDIR>>/src/soundio.cpp:8:
/<<PKGBUILDDIR>>/src/soundio.hpp:36:7: note: 'union SoundIoBackendData' declared here
 union SoundIoBackendData {
       ^~~~~~~~~~~~~~~~~~
At global scope:
cc1plus: warning: unrecognized command line option '-Wno-c99-extensions'
make[3]: *** [CMakeFiles/libsoundio_shared.dir/build.make:66: CMakeFiles/libsoundio_shared.dir/src/soundio.cpp.o] Error 1
make[3]: Leaving directory '/<<PKGBUILDDIR>>/obj-arm-linux-gnueabihf'
make[2]: *** [CMakeFiles/Makefile2:113: CMakeFiles/libsoundio_shared.dir/all] Error 2
make[2]: Leaving directory '/<<PKGBUILDDIR>>/obj-arm-linux-gnueabihf'
make[1]: *** [Makefile:133: all] Error 2
make[1]: Leaving directory '/<<PKGBUILDDIR>>/obj-arm-linux-gnueabihf'
dh_auto_build: cd obj-arm-linux-gnueabihf && make -j1 returned exit code 2
make: *** [debian/rules:8: build-arch] Error 2

Tail of log for mingw32-binutils on armhf:

dpkg-buildpackage
-----------------

dpkg-buildpackage: info: source package mingw32-binutils
dpkg-buildpackage: info: source version 2.20-0.2
dpkg-buildpackage: info: source distribution unstable
 dpkg-source --before-build .
dpkg-buildpackage: info: host architecture armhf
 fakeroot debian/rules clean
dh_testdir
dh_testroot
rm -rf /<<PKGBUILDDIR>>/build_dir *-stamp
dh_clean
dh_clean: Compatibility levels before 5 are no longer supported (level 4 requested)
make: *** [debian/rules:123: clean] Error 25

Tail of log for cryptominisat on armhf:

- _ZSt22__final_insertion_sortIN9__gnu_cxx17__normal_iteratorIPN5CMSat3LitESt6vectorIS3_SaIS3_EEEENS0_5__ops15_Iter_comp_iterINS2_5Stamp14StampSorterInvEEEEvT_SE_T0_@Base 5.6.3
+#MISSING: 5.6.4+dfsg.1-1# _ZSt22__final_insertion_sortIN9__gnu_cxx17__normal_iteratorIPN5CMSat3LitESt6vectorIS3_SaIS3_EEEENS0_5__ops15_Iter_comp_iterINS2_5Stamp11StampSorterEEEEvT_SE_T0_@Base 5.6.3
+#MISSING: 5.6.4+dfsg.1-1# _ZSt22__final_insertion_sortIN9__gnu_cxx17__normal_iteratorIPN5CMSat3LitESt6vectorIS3_SaIS3_EEEENS0_5__ops15_Iter_comp_iterINS2_5Stamp14StampSorterInvEEEEvT_SE_T0_@Base 5.6.3
  _ZSt22__final_insertion_sortIN9__gnu_cxx17__normal_iteratorIPN5CMSat3LitESt6vectorIS3_SaIS3_EEEENS0_5__ops15_Iter_less_iterEEvT_SB_T0_@Base 5.6.3
  _ZSt22__final_insertion_sortIN9__gnu_cxx17__normal_iteratorIPjSt6vectorIjSaIjEEEENS0_5__ops15_Iter_less_iterEEvT_S9_T0_@Base 5.6.3
  _ZSt22__move_median_to_firstIN9__gnu_cxx17__normal_iteratorIPN5CMSat3BVA15PotentialClauseESt6vectorIS4_SaIS4_EEEENS0_5__ops15_Iter_less_iterEEvT_SC_SC_SC_T0_@Base 5.6.3
- _ZSt22__move_median_to_firstIPN5CMSat7WatchedEN9__gnu_cxx5__ops15_Iter_comp_iterINS0_13OccSimplifier25watch_sort_smallest_firstEEEEvT_S9_S9_S9_T0_@Base 5.6.3
+ _ZSt22__move_median_to_firstIPN5CMSat7WatchedEN9__gnu_cxx5__ops15_Iter_comp_iterI11MyOccSorterEEEvT_S8_S8_S8_T0_@Base 5.6.4+dfsg.1-1
+#MISSING: 5.6.4+dfsg.1-1# _ZSt22__move_median_to_firstIPN5CMSat7WatchedEN9__gnu_cxx5__ops15_Iter_comp_iterINS0_13OccSimplifier25watch_sort_smallest_firstEEEEvT_S9_S9_S9_T0_@Base 5.6.3
+ _ZSt22__move_median_to_firstIPN5CMSat7WatchedEN9__gnu_cxx5__ops15_Iter_comp_iterINS0_21WatchSorterBinTriLongEEEEvT_S8_S8_S8_T0_@Base 5.6.4+dfsg.1-1
  _ZSt25__unguarded_linear_insertIN9__gnu_cxx17__normal_iteratorIPN5CMSat11OccurClauseESt6vectorIS3_SaIS3_EEEENS0_5__ops14_Val_comp_iterISt8functionIFbRKS3_SD_EEEEEvT_T0_@Base 5.6.3
  _ZSt25__unguarded_linear_insertIN9__gnu_cxx17__normal_iteratorIPN5CMSat3BVA15PotentialClauseESt6vectorIS4_SaIS4_EEEENS0_5__ops14_Val_less_iterEEvT_T0_@Base 5.6.3
  _ZSt25__unguarded_linear_insertIN9__gnu_cxx17__normal_iteratorIPN5CMSat3LitESt6vectorIS3_SaIS3_EEEENS0_5__ops14_Val_comp_iterINS2_5Stamp11StampSorterEEEEvT_T0_@Base 5.6.3
dh_makeshlibs: failing due to earlier errors
make: *** [debian/rules:8: binary-arch] Error 2

Tail of log for haskell-heterocephalus on armhf:

doctest: 
doctest:   -Mgrace=<n>
doctest:             The amount of allocation after the program receives a
doctest:             HeapOverflow exception before the exception is thrown again, if
doctest:             the program is still exceeding the heap limit.
doctest: 
doctest: RTS options may also be specified using the GHCRTS environment variable.
doctest: 
doctest: Other RTS options may be available for programs compiled a different way.
doctest: The GHC User's Guide has full details.
doctest: 
Test suite doctest: FAIL
Test suite logged to: dist-ghc/test/heterocephalus-1.0.5.2-doctest.log
0 of 2 test suites (0 of 2 test cases) passed.
make: *** [/usr/share/cdbs/1/class/hlibrary.mk:154: check-ghc-stamp] Error 1

Tail of log for libmlx5 on armhf:

#define HAVE_STDLIB_H 1
#define HAVE_STRING_H 1
#define HAVE_MEMORY_H 1
#define HAVE_STRINGS_H 1
#define HAVE_INTTYPES_H 1
#define HAVE_STDINT_H 1
#define HAVE_UNISTD_H 1
#define HAVE_DLFCN_H 1
#define LT_OBJDIR ".libs/"
#define NVALGRIND 1
#define HAVE_LIBIBVERBS 1

configure: exit 1
dh_auto_configure: ./configure --build=arm-linux-gnueabihf --prefix=/usr --includedir=\${prefix}/include --mandir=\${prefix}/share/man --infodir=\${prefix}/share/info --sysconfdir=/etc --localstatedir=/var --disable-silent-rules --libdir=\${prefix}/lib/arm-linux-gnueabihf --libexecdir=\${prefix}/lib/arm-linux-gnueabihf --disable-maintainer-mode --disable-dependency-tracking returned exit code 1
make: *** [debian/rules:6: build-arch] Error 2

Tail of log for libtango on armhf:

dpkg-buildpackage: info: host architecture armhf
 fakeroot debian/rules clean
QUILT_PATCHES=debian/patches \
	quilt --quiltrc /dev/null pop -a -R || test $? = 2
No patch removed
rm -rf .pc debian/stamp-patched
dh_testdir
dh_testroot
rm -rf stamps objs
find build -type d -name "objs-*" | xargs rm -rf
rm -f build-stamp-*
dh_clean
dh_clean: Compatibility levels before 9 are deprecated (level 7 in use)
 debian/rules build-arch
make: *** No rule to make target 'build-arch'.  Stop.

Tail of log for mensis on armhf:

checking for remove... yes
checking for shmat... yes
checking for IceConnectionNumber in -lICE... yes
checking for XOpenDevice in -lXi... no
checking for XkbQueryExtension in -lxkbui... no
checking for pthread_create in -lpthread... yes
checking for u_strcpy in -lgdraw... yes
checking fontforge/basics.h usability... no
checking fontforge/basics.h presence... no
checking for fontforge/basics.h... no
You must install the include files for fontforge
before building mensis.
make[1]: *** [debian/rules:29: override_dh_auto_configure] Error 1
make[1]: Leaving directory '/<<PKGBUILDDIR>>'
make: *** [debian/rules:22: build-arch] Error 2

Tail of log for osrm on armhf:

/usr/bin/c++  -DBOOST_TEST_DYN_LINK -I/<<PKGBUILDDIR>>/include -I/<<PKGBUILDDIR>>/third_party -I/<<PKGBUILDDIR>>/third_party/libosmium/include -I/usr/include/luabind -I/usr/include/lua5.2 -I/usr/include/osmpbf -I/usr/include/gdal  -g -O2 -fdebug-prefix-map=/<<PKGBUILDDIR>>=. -fstack-protector-strong -Wformat -Werror=format-security -Wdate-time -D_FORTIFY_SOURCE=2 -flto -Wall -pedantic -fPIC -fdiagnostics-color=auto -std=c++11  -fopenmp -O3 -DNDEBUG   -o CMakeFiles/OSRM.dir/algorithms/polyline_formatter.cpp.o -c /<<PKGBUILDDIR>>/algorithms/polyline_formatter.cpp
[ 54%] Building CXX object CMakeFiles/OSRM.dir/server/http/reply.cpp.o
/usr/bin/c++  -DBOOST_TEST_DYN_LINK -I/<<PKGBUILDDIR>>/include -I/<<PKGBUILDDIR>>/third_party -I/<<PKGBUILDDIR>>/third_party/libosmium/include -I/usr/include/luabind -I/usr/include/lua5.2 -I/usr/include/osmpbf -I/usr/include/gdal  -g -O2 -fdebug-prefix-map=/<<PKGBUILDDIR>>=. -fstack-protector-strong -Wformat -Werror=format-security -Wdate-time -D_FORTIFY_SOURCE=2 -flto -Wall -pedantic -fPIC -fdiagnostics-color=auto -std=c++11  -fopenmp -O3 -DNDEBUG   -o CMakeFiles/OSRM.dir/server/http/reply.cpp.o -c /<<PKGBUILDDIR>>/server/http/reply.cpp
[ 56%] Linking CXX static library libOSRM.a
/usr/bin/cmake -P CMakeFiles/OSRM.dir/cmake_clean_target.cmake
/usr/bin/cmake -E cmake_link_script CMakeFiles/OSRM.dir/link.txt --verbose=1
/usr/bin/gcc-ar qc libOSRM.a  CMakeFiles/OSRM.dir/library/osrm_impl.cpp.o CMakeFiles/OSRM.dir/descriptors/description_factory.cpp.o CMakeFiles/OSRM.dir/data_structures/route_parameters.cpp.o CMakeFiles/OSRM.dir/data_structures/search_engine_data.cpp.o CMakeFiles/OSRM.dir/util/bearing.cpp.o CMakeFiles/OSRM.dir/algorithms/douglas_peucker.cpp.o CMakeFiles/OSRM.dir/algorithms/polyline_compressor.cpp.o CMakeFiles/OSRM.dir/algorithms/polyline_formatter.cpp.o CMakeFiles/OSRM.dir/server/http/reply.cpp.o CMakeFiles/ANGLE.dir/util/compute_angle.cpp.o CMakeFiles/COORDINATE.dir/data_structures/coordinate.cpp.o CMakeFiles/COORDINATE.dir/data_structures/coordinate_calculation.cpp.o CMakeFiles/GITDESCRIPTION.dir/util/git_sha.cpp.o CMakeFiles/FINGERPRINT.dir/util/fingerprint.cpp.o CMakeFiles/LOGGER.dir/util/simple_logger.cpp.o CMakeFiles/PHANTOMNODE.dir/data_structures/phantom_node.cpp.o CMakeFiles/EXCEPTION.dir/util/osrm_exception.cpp.o CMakeFiles/MERCATOR.dir/util/mercator.cpp.o CMakeFiles/IMPORT.dir/data_structures/external_memory_node.cpp.o CMakeFiles/IMPORT.dir/data_structures/import_edge.cpp.o
/usr/bin/gcc-ranlib libOSRM.a
make[3]: Leaving directory '/<<PKGBUILDDIR>>/obj-arm-linux-gnueabihf'
[ 56%] Built target OSRM
make[2]: Leaving directory '/<<PKGBUILDDIR>>/obj-arm-linux-gnueabihf'
make[1]: *** [Makefile:133: all] Error 2
make[1]: Leaving directory '/<<PKGBUILDDIR>>/obj-arm-linux-gnueabihf'
dh_auto_build: cd obj-arm-linux-gnueabihf && make -j4 returned exit code 2
make: *** [debian/rules:6: build-arch] Error 2

Tail of log for valentina on armhf:

PASS   : TST_ValentinaCommandLine::TestOpenCollection(PajamaTopWrap2)
PASS   : TST_ValentinaCommandLine::TestOpenCollection(Keiko_skirt)
PASS   : TST_ValentinaCommandLine::TestOpenCollection(pantalon_base_Eli)
PASS   : TST_ValentinaCommandLine::TestOpenCollection(modell_2)
PASS   : TST_ValentinaCommandLine::TestOpenCollection(IMK_Zhaketa)
PASS   : TST_ValentinaCommandLine::TestOpenCollection(Moulage_0.5_armhole_neckline)
PASS   : TST_ValentinaCommandLine::TestOpenCollection(0.7_Armhole_adjustment_0.10)
PASS   : TST_ValentinaCommandLine::cleanupTestCase()
Totals: 42 passed, 2 failed, 0 skipped, 0 blacklisted, 871802ms
********* Finished testing of TST_ValentinaCommandLine *********
make[2]: *** [Makefile:441: check] Error 2
make[2]: Leaving directory '/<<PKGBUILDDIR>>/src/test/CollectionTest'
make[1]: *** [debian/rules:34: override_dh_auto_test] Error 2
make[1]: Leaving directory '/<<PKGBUILDDIR>>'
make: *** [debian/rules:12: binary-arch] Error 2

Tail of log for mariadb-10.3 on armhf:

The log files in var/log may give you some hint of what went wrong.

If you want to report this error, please read first the documentation
at http://dev.mysql.com/doc/mysql/en/mysql-test-suite.html

Errors/warnings were found in logfiles during server shutdown after running the
following sequence(s) of tests:
    main.stat_tables_innodb
93 tests were skipped, 38 by the test itself.

mysql-test-run: *** ERROR: there were failing test cases
make[1]: *** [debian/rules:131: override_dh_auto_test] Error 1
make[1]: Leaving directory '/<<PKGBUILDDIR>>'
make: *** [debian/rules:216: build-arch] Error 2