Raspbian Package Auto-Building

Buildd status for oclgrind (buster-staging)

Debian PTSTrackerChangelogBugspackages.d.obuildd.d.o

Package(s): Suite:
Compact mode Co-maintainers

ArchitectureVersionStatusForBuilddStateMiscLogs
Buildd exposure stats armhf  18.3-2Build-Attempted164d 6h 45mbm-wb-03out-of-datemisc:optionalold | all (17)

Tail of log for oclgrind on armhf:

96% tests passed, 4 tests failed out of 96

Total Test time (real) =  51.21 sec

The following tests FAILED:
	 54 - interactive/struct_member (Failed)
	 68 - misc/lvalue_loads (Failed)
	 79 - uninitialized/partially_uninitialized_fract (Failed)
	 80 - uninitialized/private_array_initializer_list (Failed)
Errors while running CTest
make[1]: *** [Makefile:88: test] Error 8
make[1]: Leaving directory '/<<PKGBUILDDIR>>/obj-arm-linux-gnueabihf'
dh_auto_test: cd obj-arm-linux-gnueabihf && make -j4 test ARGS\+=-j4 returned exit code 2
make: *** [debian/rules:13: build-arch] Error 2