Raspbian Package Auto-Building

Buildd status for numactl (jessie-staging)

Debian PTSTrackerChangelogBugspackages.d.obuildd.d.o

Package(s): Suite:
Compact mode Co-maintainers

ArchitectureVersionStatusForBuilddStateMiscLogs
Buildd exposure stats armhf  2.0.10-1Build-Attempted183d 12h 22mtestbuildduncompiledadmin:sourceold | all (11)

Tail of log for numactl on armhf:

syscall.c:209:17: error: '__NR_migrate_pages' undeclared (first use in this function)
  return syscall(__NR_migrate_pages, pid, maxnode, frommask, tomask);
                 ^
syscall.c:209:17: note: each undeclared identifier is reported only once for each function it appears in
syscall.c:210:1: warning: control reaches end of non-void function [-Wreturn-type]
 }
 ^
Makefile:1013: recipe for target 'syscall.lo' failed
make[2]: *** [syscall.lo] Error 1
make[2]: Leaving directory '/<<PKGBUILDDIR>>'
Makefile:688: recipe for target 'all' failed
make[1]: *** [all] Error 2
make[1]: Leaving directory '/<<PKGBUILDDIR>>'
/usr/share/cdbs/1/class/makefile.mk:47: recipe for target 'debian/stamp-makefile-build' failed
make: *** [debian/stamp-makefile-build] Error 2