Raspbian Package Auto-Building

Buildd status for nix (bullseye-staging)

Debian PTSTrackerChangelogBugspackages.d.obuildd.d.o

Package(s): Suite:
Compact mode Co-maintainers

ArchitectureVersionStatusForBuilddStateMiscLogs
Buildd exposure stats armhf  2.3.7+dfsg1-1Build-Attempted53d 19h 42mtestbuildduncompiledmisc:extraold | all (1)

Tail of log for nix on armhf:

/usr/include/c++/10/bits/vector.tcc:121:21: note: parameter passing for argument of type '__gnu_cxx::__normal_iterator<nlohmann::basic_json<>*, std::vector<nlohmann::basic_json<>, std::allocator<nlohmann::basic_json<> > > >' changed in GCC 7.1
  121 |    _M_realloc_insert(end(), std::forward<_Args>(__args)...);
      |    ~~~~~~~~~~~~~~~~~^~~~~~~~~~~~~~~~~~~~~~~~~~~~~~~~~~~~~~~
g++ -std=c++17 -o /<<BUILDDIR>>/nix-2.3.7+dfsg1/src/libutil/libnixutil.so -shared -L/usr/lib/arm-linux-gnueabihf -Wl,-z,relro -Wl,-z,now -L/usr/lib/arm-linux-gnueabihf -Wl,-z,relro -Wl,-z,now -Wl,--no-copy-dt-needed-entries src/libutil/affinity.o src/libutil/archive.o src/libutil/args.o src/libutil/compression.o src/libutil/config.o src/libutil/hash.o src/libutil/json.o src/libutil/logging.o src/libutil/serialise.o src/libutil/thread-pool.o src/libutil/util.o src/libutil/xml-writer.o -llzma -lbz2 -pthread -lcrypto -lbrotlienc -lbrotlidec -L/usr/lib/arm-linux-gnueabihf -lboost_context -Wl,-z,defs -Wl,-soname=libnixutil.so   
/usr/bin/ld: /usr/bin/ld: DWARF error: could not find variable specification at offset 417e9
/usr/bin/ld: DWARF error: could not find variable specification at offset 41ca2
src/libutil/logging.o: in function `std::__atomic_base<unsigned long long>::fetch_add(unsigned long long, std::memory_order)':
/usr/include/c++/10/bits/atomic_base.h:548: undefined reference to `__atomic_fetch_add_8'
g++ -std=c++17 -o src/libstore/local-store.o -c src/libstore/local-store.cc -fstack-protector-strong -Wformat -Werror=format-security -g -Wall -include config.h -Wdate-time -D_FORTIFY_SOURCE=2 -fPIC -g -I . -I src -I src/libutil -I src/libstore -I src/libmain -I src/libexpr -I src/nix  -DREADLINE -I/usr/include/arm-linux-gnueabihf -I/usr/include -g -O2 -fdebug-prefix-map=/<<BUILDDIR>>/nix-2.3.7+dfsg1=. -fstack-protector-strong -Wformat -Werror=format-security -DNIX_PREFIX=\"/usr\" -DNIX_STORE_DIR=\"/nix/store\" -DNIX_DATA_DIR=\"/usr/share\" -DNIX_STATE_DIR=\"/nix/var/nix\" -DNIX_LOG_DIR=\"/nix/var/log/nix\" -DNIX_CONF_DIR=\"/etc/nix\" -DNIX_LIBEXEC_DIR=\"/usr/libexec\" -DNIX_BIN_DIR=\"/usr/bin\" -DNIX_MAN_DIR=\"/usr/share/man\" -DLSOF=\"lsof\" -MMD -MF src/libstore/.local-store.o.dep -MP
collect2: error: ld returned 1 exit status
make[1]: *** [mk/lib.mk:104: src/libutil/libnixutil.so] Error 1
make[1]: *** Waiting for unfinished jobs....
make[1]: Leaving directory '/<<BUILDDIR>>/nix-2.3.7+dfsg1'
dh_auto_build: error: make -j4 returned exit code 2
make: *** [debian/rules:31: build-arch] Error 25