Raspbian Package Auto-Building

Buildd status for nestopia (stretch-staging)

Debian PTSTrackerChangelogBugspackages.d.obuildd.d.o

Package(s): Suite:
Compact mode Co-maintainers

ArchitectureVersionStatusForBuilddStateMiscLogs
Buildd exposure stats armhf  1.47-2Build-Attempted908d 2h 6mbm-wb-03out-of-datemisc:sourceold | all (9)

Tail of log for nestopia on armhf:

g++ -g -O2 -fdebug-prefix-map=/<<PKGBUILDDIR>>=. -specs=/usr/share/dpkg/no-pie-compile.specs -fstack-protector-strong -Wformat -Werror=format-security -fpermissive -Isource -Wno-write-strings -Wno-deprecated-declarations -DDATADIR=\"/usr/share/nestopia\" -D_GTK -g -O2 -fdebug-prefix-map=/<<PKGBUILDDIR>>=. -specs=/usr/share/dpkg/no-pie-compile.specs -fstack-protector-strong -Wformat -Werror=format-security -fpermissive -I/usr/include/SDL2 -D_REENTRANT -pthread -I/usr/include/gtk-3.0 -I/usr/include/at-spi2-atk/2.0 -I/usr/include/at-spi-2.0 -I/usr/include/dbus-1.0 -I/usr/lib/arm-linux-gnueabihf/dbus-1.0/include -I/usr/include/gtk-3.0 -I/usr/include/gio-unix-2.0/ -I/usr/include/cairo -I/usr/include/pango-1.0 -I/usr/include/harfbuzz -I/usr/include/pango-1.0 -I/usr/include/atk-1.0 -I/usr/include/cairo -I/usr/include/pixman-1 -I/usr/include/freetype2 -I/usr/include/libpng16 -I/usr/include/gdk-pixbuf-2.0 -I/usr/include/libpng16 -I/usr/include/glib-2.0 -I/usr/lib/arm-linux-gnueabihf/glib-2.0/include -c source/unix/gtkui/gtkui.cpp -o objs/unix/gtkui/gtkui.o
In file included from source/unix/gtkui/gtkui.cpp:31:0:
source/unix/gtkui/gtkui.h:11:28: fatal error: gdk/gdkwayland.h: No such file or directory
 #include <gdk/gdkwayland.h>
                            ^
compilation terminated.
Makefile:381: recipe for target 'objs/unix/gtkui/gtkui.o' failed
make[2]: *** [objs/unix/gtkui/gtkui.o] Error 1
make[2]: Leaving directory '/<<PKGBUILDDIR>>'
dh_auto_build: make -j1 returned exit code 2
debian/rules:27: recipe for target 'override_dh_auto_build' failed
make[1]: *** [override_dh_auto_build] Error 2
make[1]: Leaving directory '/<<PKGBUILDDIR>>'
debian/rules:24: recipe for target 'build-arch' failed
make: *** [build-arch] Error 2