Raspbian Package Auto-Building

Buildd status for neovim (stretch-staging)

Debian PTSTrackerChangelogBugspackages.d.obuildd.d.o

Package(s): Suite:
Compact mode Co-maintainers

ArchitectureVersionStatusForBuilddStateMiscLogs
Buildd exposure stats armhf  0.1.7-4+deb9u1Build-Attempted143d 1h 31mtestwandboardout-of-datemisc:sourceold | all (1)

Tail of log for neovim on armhf:

CMake Error at /<<PKGBUILDDIR>>/cmake/RunTests.cmake:46 (message):
  Running functional tests failed with error: 1.


FAILED: CMakeFiles/functionaltest 
cd /<<PKGBUILDDIR>>/build && /usr/bin/cmake -DBUSTED_PRG=/usr/bin/busted -DLUA_PRG=/usr/bin/luajit -DNVIM_PRG=/<<PKGBUILDDIR>>/build/bin/nvim -DWORKING_DIR=/<<PKGBUILDDIR>> -DBUSTED_OUTPUT_TYPE=TAP -DTEST_DIR=/<<PKGBUILDDIR>>/test -DBUILD_DIR=/<<PKGBUILDDIR>>/build -DTEST_TYPE=functional -DSYSTEM_NAME=Linux -P /<<PKGBUILDDIR>>/cmake/RunTests.cmake
ninja: build stopped: subcommand failed.
Makefile:95: recipe for target 'functionaltest' failed
make[2]: *** [functionaltest] Error 1
make[2]: Leaving directory '/<<PKGBUILDDIR>>'
debian/rules:55: recipe for target 'override_dh_auto_test-arch' failed
make[1]: *** [override_dh_auto_test-arch] Error 2
make[1]: Leaving directory '/<<PKGBUILDDIR>>'
debian/rules:30: recipe for target 'build-arch' failed
make: *** [build-arch] Error 2