Raspbian Package Auto-Building

Buildd status for ne10 (stretch-staging)

Debian PTSTrackerChangelogBugspackages.d.obuildd.d.o

Package(s): Suite:
Compact mode Co-maintainers

ArchitectureVersionStatusForBuilddStateMiscLogs
Buildd exposure stats armhf  1.2.1-3Build-Attempted905d 12h 45mmb-lxc-01uncompiledmisc:sourceold | all (7)

Tail of log for ne10 on armhf:

/<<PKGBUILDDIR>>/modules/dsp/NE10_fft_int16.neonintrinsic.c:479:9: note: in expansion of macro 'RADIX8x4_LOAD'
         RADIX8x4_LOAD
         ^~~~~~~~~~~~~
modules/CMakeFiles/NE10.dir/build.make:473: recipe for target 'modules/CMakeFiles/NE10.dir/dsp/NE10_fft_int16.neonintrinsic.c.o' failed
make[3]: *** [modules/CMakeFiles/NE10.dir/dsp/NE10_fft_int16.neonintrinsic.c.o] Error 1
make[3]: Leaving directory '/<<PKGBUILDDIR>>/obj-arm-linux-gnueabihf'
CMakeFiles/Makefile2:161: recipe for target 'modules/CMakeFiles/NE10.dir/all' failed
make[2]: *** [modules/CMakeFiles/NE10.dir/all] Error 2
make[2]: Leaving directory '/<<PKGBUILDDIR>>/obj-arm-linux-gnueabihf'
Makefile:130: recipe for target 'all' failed
make[1]: *** [all] Error 2
make[1]: Leaving directory '/<<PKGBUILDDIR>>/obj-arm-linux-gnueabihf'
dh_auto_build: make -j4 returned exit code 2
debian/rules:17: recipe for target 'build-arch' failed
make: *** [build-arch] Error 2