Raspbian Package Auto-Building

Buildd status for myproxy (stretch-staging)

Debian PTSTrackerChangelogBugspackages.d.obuildd.d.o

Package(s): Suite:
Compact mode Co-maintainers

ArchitectureVersionStatusForBuilddStateMiscLogs
Buildd exposure stats armhf  6.1.22-1Build-Attempted908d 4h 18mtestwandboardout-of-datenet:sourceold | all (6)

Tail of log for myproxy on armhf:

============================================================================
Makefile:1495: recipe for target 'test-suite.log' failed
make[4]: *** [test-suite.log] Error 1
make[4]: Leaving directory '/<<PKGBUILDDIR>>'
Makefile:1601: recipe for target 'check-TESTS' failed
make[3]: *** [check-TESTS] Error 2
make[3]: Leaving directory '/<<PKGBUILDDIR>>'
Makefile:1832: recipe for target 'check-am' failed
make[2]: *** [check-am] Error 2
make[2]: Leaving directory '/<<PKGBUILDDIR>>'
Makefile:1381: recipe for target 'check-recursive' failed
make[1]: *** [check-recursive] Error 1
make[1]: Leaving directory '/<<PKGBUILDDIR>>'
debian/rules:60: recipe for target 'build-stamp' failed
make: *** [build-stamp] Error 2