Raspbian Package Auto-Building

Buildd status for mrtrix3, monero (buster-staging)

Bugs

Package(s): Suite:
Compact mode Co-maintainers

Package armhf
Buildd exposure stats
✔ mrtrix3Maybe-Failed
✔ moneroMaybe-Failed

Tail of log for mrtrix3 on armhf:

                 from ./core/app.h:27,
                 from ./core/command.h:24,
                 from cmd/mrtransform.cpp:16:
/usr/include/c++/8/bits/stl_vector.h: In function 'void run()':
/usr/include/c++/8/bits/stl_vector.h:1085:4: note: parameter passing for argument of type '__gnu_cxx::__normal_iterator<MR::Header*, std::vector<MR::Header, Eigen::aligned_allocator<MR::Header> > >' changed in GCC 7.1
    _M_realloc_insert(end(), __x);
    ^~~~~~~~~~~~~~~~~
/usr/include/c++/8/bits/stl_vector.h:1085:4: note: parameter passing for argument of type '__gnu_cxx::__normal_iterator<MR::Header*, std::vector<MR::Header, Eigen::aligned_allocator<MR::Header> > >' changed in GCC 7.1
    _M_realloc_insert(end(), __x);
    ^~~~~~~~~~~~~~~~~


make[1]: *** [debian/rules:39: override_dh_auto_build] Error 1
make[1]: Leaving directory '/<<BUILDDIR>>/mrtrix3-3.0~rc3+git135-g2b8e7d0c2'
make: *** [debian/rules:33: build-arch] Error 2

Tail of log for monero on armhf:

In file included from /usr/include/c++/8/vector:69,
                 from /usr/include/c++/8/bits/random.h:34,
                 from /usr/include/c++/8/random:49,
                 from /<<PKGBUILDDIR>>/src/wallet/wallet2.cpp:32:
/usr/include/c++/8/bits/vector.tcc: In member function 'bool epee::json_rpc::response<t_param, t_error>::load(t_storage&, typename t_storage::hsection) [with t_storage = epee::serialization::portable_storage; t_param = cryptonote::COMMAND_RPC_GET_BLOCK_HEADERS_RANGE::response; t_error = epee::json_rpc::error]':
/usr/include/c++/8/bits/vector.tcc:149:2: note: parameter passing for argument of type '__gnu_cxx::__normal_iterator<cryptonote::block_header_response*, std::vector<cryptonote::block_header_response> >' changed in GCC 7.1
  _M_realloc_insert(begin() + (__position - cbegin()), __x);
  ^~~~~~~~~~~~~~~~~
make[3]: Leaving directory '/<<PKGBUILDDIR>>/obj-arm-linux-gnueabihf'
[ 55%] Built target obj_wallet
make[2]: Leaving directory '/<<PKGBUILDDIR>>/obj-arm-linux-gnueabihf'
make[1]: *** [Makefile:144: all] Error 2
make[1]: Leaving directory '/<<PKGBUILDDIR>>/obj-arm-linux-gnueabihf'
dh_auto_build: cd obj-arm-linux-gnueabihf && make -j4 returned exit code 2
make: *** [debian/rules:10: binary-arch] Error 2