Raspbian Package Auto-Building

Buildd status for mrs (buster-staging)

Debian PTSTrackerChangelogBugspackages.d.obuildd.d.o

Package(s): Suite:
Compact mode Co-maintainers

ArchitectureVersionStatusForBuilddStateMiscLogs
Buildd exposure stats armhf  6.0.5+dfsg-7Build-Attempted166d 8h 20mmb-lxc-01uncompiledmisc:optionalold | all (20)

Tail of log for mrs on armhf:

/usr/bin/ld: obj/M6Progress.o: in function `M6Progress::Progress(long long)':
/usr/include/c++/8/bits/atomic_base.h:374: undefined reference to `__atomic_store_8'
/usr/bin/ld: obj/M6Progress.o: in function `M6Progress::~M6Progress()':
/usr/include/c++/8/bits/atomic_base.h:374: undefined reference to `__atomic_store_8'
/usr/bin/ld: obj/M6Progress.o: in function `M6ProgressImpl::PrintProgress()':
/usr/include/c++/8/bits/atomic_base.h:396: undefined reference to `__atomic_load_8'
/usr/bin/ld: obj/M6Progress.o: in function `M6ProgressImpl::Run()':
/usr/include/c++/8/bits/atomic_base.h:396: undefined reference to `__atomic_load_8'
/usr/bin/ld: /usr/include/c++/8/bits/atomic_base.h:396: undefined reference to `__atomic_load_8'
/usr/bin/ld: /usr/include/c++/8/bits/atomic_base.h:396: undefined reference to `__atomic_load_8'
collect2: error: ld returned 1 exit status
make[1]: *** [GNUmakefile:101: mrs] Error 1
make[1]: Leaving directory '/<<BUILDDIR>>/mrs-6.0.5+dfsg'
dh_auto_build: make -j4 returned exit code 2
make: *** [debian/rules:12: build-arch] Error 2