Raspbian Package Auto-Building

Buildd status for minimap2 (buster-staging)

Debian PTSTrackerChangelogBugspackages.d.obuildd.d.o

Package(s): Suite:
Compact mode Co-maintainers

ArchitectureVersionStatusForBuilddStateMiscLogs
Buildd exposure stats armhf  2.15+dfsg-1Build-Attempted166d 5h 51mtestwandboarduncompiledmisc:extraold | all (18)

Tail of log for minimap2 on armhf:

                                                           ~~^                                                   ~~~~~~~~~~~~
                                                           %d
cc -c -g -O2 -fdebug-prefix-map=/<<BUILDDIR>>/minimap2-2.15+dfsg=. -fstack-protector-strong -Wformat -Werror=format-security -g -Wall -O2 -Wc++-compat  -Wdate-time -D_FORTIFY_SOURCE=2 -DHAVE_KALLOC  format.c -o format.o
cc -c -g -O2 -fdebug-prefix-map=/<<BUILDDIR>>/minimap2-2.15+dfsg=. -fstack-protector-strong -Wformat -Werror=format-security -g -Wall -O2 -Wc++-compat  -Wdate-time -D_FORTIFY_SOURCE=2 -DHAVE_KALLOC  pe.c -o pe.o
cc -c -g -O2 -fdebug-prefix-map=/<<BUILDDIR>>/minimap2-2.15+dfsg=. -fstack-protector-strong -Wformat -Werror=format-security -g -Wall -O2 -Wc++-compat  -Wdate-time -D_FORTIFY_SOURCE=2 -DHAVE_KALLOC  esterr.c -o esterr.o
cc -c -g -O2 -fdebug-prefix-map=/<<BUILDDIR>>/minimap2-2.15+dfsg=. -fstack-protector-strong -Wformat -Werror=format-security -g -Wall -O2 -Wc++-compat  -Wdate-time -D_FORTIFY_SOURCE=2 -DHAVE_KALLOC  splitidx.c -o splitidx.o
cc -c -g -O2 -fdebug-prefix-map=/<<BUILDDIR>>/minimap2-2.15+dfsg=. -fstack-protector-strong -Wformat -Werror=format-security -g -Wall -O2 -Wc++-compat  -msse2 -Wdate-time -D_FORTIFY_SOURCE=2 -DHAVE_KALLOC  ksw2_ll_sse.c -o ksw2_ll_sse.o
cc: error: unrecognized command line option '-msse2'
make[2]: *** [Makefile:51: ksw2_ll_sse.o] Error 1
make[2]: *** Waiting for unfinished jobs....
make[2]: Leaving directory '/<<BUILDDIR>>/minimap2-2.15+dfsg'
dh_auto_build: make -j4 "INSTALL=install --strip-program=true" returned exit code 2
make[1]: *** [debian/rules:13: override_dh_auto_build] Error 2
make[1]: Leaving directory '/<<BUILDDIR>>/minimap2-2.15+dfsg'
make: *** [debian/rules:6: build-arch] Error 2