Raspbian Package Auto-Building

Buildd status for micropython (bullseye-staging)

Debian PTSTrackerChangelogBugspackages.d.obuildd.d.o

Package(s): Suite:
Compact mode Co-maintainers

ArchitectureVersionStatusForBuilddStateMiscLogs
Buildd exposure stats armhf  1.12-2Build-Attempted72d 18h 13mmb-lxc-01uncompiledmisc:extraold | all (5)

Tail of log for micropython on armhf:

pass  unicode/unicode_subscr.py
skip  unix/extra_coverage.py
pass  unix/ffi_callback.py
pass  unix/ffi_float.py
pass  unix/ffi_float2.py
734 tests performed (19889 individual testcases)
728 tests passed
40 tests skipped: async_with async_with2 async_with_break async_with_return del_deref del_local exception_chain fun_name gen_yield_from_close generator_name scope_implicit try_finally_return2 try_reraise try_reraise2 unboundlocal cmd_parsetree btree1 vfs_blockdev vfs_fat_fileio1 vfs_fat_fileio2 vfs_fat_more vfs_fat_oldproto vfs_fat_ramdisk vfs_fat_ramdisklarge vfs_lfs vfs_lfs_corrupt vfs_lfs_error vfs_lfs_file vfs_lfs_mount emg_exc heapalloc_traceback opt_level_lineno schedule features print_exception sys_exc_info sys_settrace_features sys_settrace_generator sys_settrace_loop extra_coverage
6 tests failed: fun_largestate string_format2 import_pkg3 import_pkg4 import_pkg6 extreme_exc
make[2]: *** [Makefile:198: test] Error 1
make[2]: Leaving directory '/<<PKGBUILDDIR>>/ports/unix'
dh_auto_test: error: cd ports/unix && make -j4 test STRIP=true MICROPY_PY_BTREE=0 MICROPY_SSL_AXTLS=0 MICROPY_SSL_MBEDTLS=1 MICROPY_PY_JNI=1 "TESTS_ARGS=--emit native -e '(?:ussl_basic|mpy_native)'" returned exit code 2
make[1]: *** [debian/rules:67: override_dh_auto_test-arch] Error 25
make[1]: Leaving directory '/<<PKGBUILDDIR>>'
make: *** [debian/rules:37: binary-arch] Error 2