Raspbian Package Auto-Building

Buildd status for metabat (bullseye-staging)

Debian PTSTrackerChangelogBugspackages.d.obuildd.d.o

Package(s): Suite:
Compact mode Co-maintainers

ArchitectureVersionStatusForBuilddStateMiscLogs
Buildd exposure stats armhf  2.15-2Build-Attempted65d 6h 34mtest2019uncompiledmisc:sourceold | all (2)

Tail of log for metabat on armhf:

                 from /<<PKGBUILDDIR>>/src/metabat1.h:38,
                 from /<<PKGBUILDDIR>>/src/metabat1.cpp:1:
/usr/include/c++/10/bits/stl_algo.h:4892:18: note: parameter passing for argument of type ‘__gnu_cxx::__normal_iterator<std::pair<int, double>*, std::vector<std::pair<int, double> > >’ changed in GCC 7.1
 4892 |       std::__sort(__first, __last, __gnu_cxx::__ops::__iter_comp_iter(__comp));
      |       ~~~~~~~~~~~^~~~~~~~~~~~~~~~~~~~~~~~~~~~~~~~~~~~~~~~~~~~~~~~~~~~~~~~~~~~~
[ 87%] Linking CXX executable metabat1
cd /<<PKGBUILDDIR>>/obj-arm-linux-gnueabihf/src && /usr/bin/cmake -E cmake_link_script CMakeFiles/metabat1.dir/link.txt --verbose=1
/usr/bin/c++  -g -O2 -fdebug-prefix-map=/<<PKGBUILDDIR>>=. -fstack-protector-strong -Wformat -Werror=format-security -Wdate-time -D_FORTIFY_SOURCE=2 -fopenmp  -Wl,-z,relro -Wl,-z,now  CMakeFiles/metabat1.dir/metabat1.cpp.o  -o metabat1  -lhts /usr/lib/arm-linux-gnueabihf/libz.so /usr/lib/arm-linux-gnueabihf/libboost_program_options.a /usr/lib/arm-linux-gnueabihf/libboost_filesystem.a /usr/lib/arm-linux-gnueabihf/libboost_system.a /usr/lib/arm-linux-gnueabihf/libboost_graph.a /usr/lib/arm-linux-gnueabihf/libboost_serialization.a /usr/lib/arm-linux-gnueabihf/libboost_iostreams.a /usr/lib/arm-linux-gnueabihf/libboost_regex.a 
make[3]: Leaving directory '/<<PKGBUILDDIR>>/obj-arm-linux-gnueabihf'
[ 87%] Built target metabat1
make[2]: Leaving directory '/<<PKGBUILDDIR>>/obj-arm-linux-gnueabihf'
make[1]: *** [Makefile:144: all] Error 2
make[1]: Leaving directory '/<<PKGBUILDDIR>>/obj-arm-linux-gnueabihf'
dh_auto_build: error: cd obj-arm-linux-gnueabihf && make -j4 "INSTALL=install --strip-program=true" returned exit code 2
make: *** [debian/rules:11: binary-arch] Error 25