Raspbian Package Auto-Building

Buildd status for mariadb-connector-odbc (bullseye-staging)

Debian PTSTrackerChangelogBugspackages.d.obuildd.d.o

Package(s): Suite:
Compact mode Co-maintainers

ArchitectureVersionStatusForBuilddStateMiscLogs
Buildd exposure stats armhf  3.1.4-1Build-Attempted10d 23h 56mmb-lxc-01uncompiledmisc:sourceold | all (3)

Tail of log for mariadb-connector-odbc on armhf:

/usr/bin/cmake -E cmake_link_script CMakeFiles/cmTC_16fa4.dir/link.txt --verbose=1
/usr/bin/cc -g -O2 -fdebug-prefix-map=/<<PKGBUILDDIR>>=. -fstack-protector-strong -Wformat -Werror=format-security -I/usr/include/mariadb -Wdate-time -D_FORTIFY_SOURCE=2 -DCHECK_FUNCTION_EXISTS=floor  -Wl,-z,relro  -rdynamic CMakeFiles/cmTC_16fa4.dir/CheckFunctionExists.c.o  -o cmTC_16fa4 
/usr/bin/ld: CMakeFiles/cmTC_16fa4.dir/CheckFunctionExists.c.o: in function `main':
/usr/share/cmake-3.13/Modules/CheckFunctionExists.c:17: undefined reference to `floor'
collect2: error: ld returned 1 exit status
make[3]: *** [CMakeFiles/cmTC_16fa4.dir/build.make:87: cmTC_16fa4] Error 1
make[3]: Leaving directory '/<<PKGBUILDDIR>>/obj-arm-linux-gnueabihf/CMakeFiles/CMakeTmp'
make[2]: *** [Makefile:121: cmTC_16fa4/fast] Error 2
make[2]: Leaving directory '/<<PKGBUILDDIR>>/obj-arm-linux-gnueabihf/CMakeFiles/CMakeTmp'


dh_auto_configure: cd obj-arm-linux-gnueabihf && cmake -DCMAKE_INSTALL_PREFIX=/usr -DCMAKE_BUILD_TYPE=None -DCMAKE_INSTALL_SYSCONFDIR=/etc -DCMAKE_INSTALL_LOCALSTATEDIR=/var -DCMAKE_EXPORT_NO_PACKAGE_REGISTRY=ON -DCMAKE_FIND_PACKAGE_NO_PACKAGE_REGISTRY=ON -DCMAKE_INSTALL_RUNSTATEDIR=/run "-GUnix Makefiles" -DCMAKE_VERBOSE_MAKEFILE=ON -DCMAKE_INSTALL_LIBDIR=lib/arm-linux-gnueabihf -DMARIADB_LINK_DYNAMIC=yes -DINSTALL_LIB_SUFFIX=lib/arm-linux-gnueabihf/odbc .. returned exit code 1
make[1]: *** [debian/rules:11: override_dh_auto_configure] Error 255
make[1]: Leaving directory '/<<PKGBUILDDIR>>'
make: *** [debian/rules:8: build-arch] Error 2