Raspbian Package Auto-Building

Buildd status for lives (bullseye-staging)

Debian PTSTrackerChangelogBugspackages.d.obuildd.d.o

Package(s): Suite:
Compact mode Co-maintainers

ArchitectureVersionStatusForBuilddStateMiscLogs
Buildd exposure stats armhf  3.0.2-1+b2Build-Attempted69d 4h 1mbm-wb-03out-of-datevideo:sourceold | all (1)

BinNMU changelog for lives on armhf:

rebuild due to debcheck failure

Tail of log for lives on armhf:

/usr/bin/ld: giw/giwtimeline.o:./src/./widget-helper-gtk.h:960: multiple definition of `LIVES_STOCK_LABEL_OPEN'; widget-helper.o:./src/widget-helper-gtk.h:960: first defined here
/usr/bin/ld: giw/giwtimeline.o:./src/./widget-helper-gtk.h:959: multiple definition of `LIVES_STOCK_LABEL_SAVE_AS'; widget-helper.o:./src/widget-helper-gtk.h:959: first defined here
/usr/bin/ld: giw/giwtimeline.o:./src/./widget-helper-gtk.h:958: multiple definition of `LIVES_STOCK_LABEL_SAVE'; widget-helper.o:./src/widget-helper-gtk.h:958: first defined here
/usr/bin/ld: giw/giwtimeline.o:./src/./widget-helper-gtk.h:957: multiple definition of `LIVES_STOCK_LABEL_NO'; widget-helper.o:./src/widget-helper-gtk.h:957: first defined here
/usr/bin/ld: giw/giwtimeline.o:./src/./widget-helper-gtk.h:956: multiple definition of `LIVES_STOCK_LABEL_YES'; widget-helper.o:./src/widget-helper-gtk.h:956: first defined here
/usr/bin/ld: giw/giwtimeline.o:./src/./widget-helper-gtk.h:955: multiple definition of `LIVES_STOCK_LABEL_OK'; widget-helper.o:./src/widget-helper-gtk.h:955: first defined here
/usr/bin/ld: giw/giwtimeline.o:./src/./widget-helper-gtk.h:954: multiple definition of `LIVES_STOCK_LABEL_CANCEL'; widget-helper.o:./src/widget-helper-gtk.h:954: first defined here
/usr/bin/ld: giw/giwtimeline.o:./src/./support.h:23: multiple definition of `trString'; widget-helper.o:./src/support.h:23: first defined here
collect2: error: ld returned 1 exit status
make[2]: *** [Makefile:1000: lives-exe] Error 1
make[2]: Leaving directory '/<<PKGBUILDDIR>>/src'
make[1]: *** [Makefile:645: all-recursive] Error 1
make[1]: Leaving directory '/<<PKGBUILDDIR>>'
dh_auto_build: error: make -j4 returned exit code 2
make: *** [debian/rules:7: build-arch] Error 25