Raspbian Package Auto-Building

Buildd status for libzypp (jessie-staging)

Debian PTSTrackerChangelogBugspackages.d.obuildd.d.o

Package(s): Suite:
Compact mode Co-maintainers

ArchitectureVersionStatusForBuilddStateMiscLogs
Buildd exposure stats armhf  14.29.1-2Build-Attempted182d 7h 10mbm-wb-04uncompiledmisc:sourceold | all (7)

Tail of log for libzypp on armhf:

      Start  8: CpeId_test

8: Test command: /<<PKGBUILDDIR>>/obj-arm-linux-gnueabihf/tests/zypp/CpeId_test "--catch_system_errors=no"
8: Test timeout computed to be: 9.99988e+06
tests/CMakeFiles/ctest.dir/build.make:52: recipe for target 'tests/CMakeFiles/ctest' failed
make[4]: *** [tests/CMakeFiles/ctest] Terminated
CMakeFiles/Makefile2:2791: recipe for target 'tests/CMakeFiles/ctest.dir/all' failed
make[3]: *** [tests/CMakeFiles/ctest.dir/all] Terminated
CMakeFiles/Makefile2:2799: recipe for target 'tests/CMakeFiles/ctest.dir/rule' failed
make[2]: *** [tests/CMakeFiles/ctest.dir/rule] Terminated
Makefile:1185: recipe for target 'ctest' failed
make[1]: *** [ctest] Terminated
/usr/share/cdbs/1/class/makefile.mk:67: recipe for target 'debian/stamp-makefile-check' failed
make: *** [debian/stamp-makefile-check] Terminated
E: Caught signal ‘Terminated’: terminating immediately