Raspbian Package Auto-Building

Buildd status for libundead (bullseye-staging)

Debian PTSTrackerChangelogBugspackages.d.obuildd.d.o

Package(s): Suite:
Compact mode Co-maintainers

ArchitectureVersionStatusForBuilddStateMiscLogs
Buildd exposure stats armhf  1.0.10-1Build-Attempted14d 2h 14mmb-lxc-02uncompiledmisc:optionalold | all (3)

Tail of log for libundead on armhf:

/<<PKGBUILDDIR>>/src/undead/stream.d:1207:10: error: generic thunk code fails for method ‘_DT12_D6undead6stream6Stream6printfMFAxaYk’ which uses ‘...’
 1207 |   size_t printf(const(char)[] format, ...) {
      |          ^
/<<PKGBUILDDIR>>/src/undead/stream.d:1222:16: error: generic thunk code fails for method ‘_DT12_D6undead6stream6Stream6writefMFYC6undead6stream12OutputStream’ which uses ‘...’
 1222 |   OutputStream writef(...) {
      |                ^
/<<PKGBUILDDIR>>/src/undead/stream.d:1227:16: error: generic thunk code fails for method ‘_DT12_D6undead6stream6Stream8writeflnMFYC6undead6stream12OutputStream’ which uses ‘...’
 1227 |   OutputStream writefln(...) {
      |                ^
[3/29] gdc -Iundead@sha -I. -I.. -I../src/ -g -O2 -fdebug-prefix-map=/<<PKGBUILDDIR>>=. -fstack-protector-strong -frelease -fPIC -MD -MQ 'undead@sha/src_undead_bitarray.d.o' -MF 'undead@sha/src_undead_bitarray.d.o.deps' -o 'undead@sha/src_undead_bitarray.d.o' -c ../src/undead/bitarray.d
[4/29] gdc -Iundead@sha -I. -I.. -I../src/ -g -O2 -fdebug-prefix-map=/<<PKGBUILDDIR>>=. -fstack-protector-strong -frelease -fPIC -MD -MQ 'undead@sha/src_undead_date.d.o' -MF 'undead@sha/src_undead_date.d.o.deps' -o 'undead@sha/src_undead_date.d.o' -c ../src/undead/date.d
[5/29] gdc -Iundead@sha -I. -I.. -I../src/ -g -O2 -fdebug-prefix-map=/<<PKGBUILDDIR>>=. -fstack-protector-strong -frelease -fPIC -MD -MQ 'undead@sha/src_undead_dateparse.d.o' -MF 'undead@sha/src_undead_dateparse.d.o.deps' -o 'undead@sha/src_undead_dateparse.d.o' -c ../src/undead/dateparse.d
ninja: build stopped: subcommand failed.
dh_auto_build: cd obj-arm-linux-gnueabihf && LC_ALL=C.UTF-8 ninja -j4 -v returned exit code 1
make: *** [debian/rules:9: build-arch] Error 255