Raspbian Package Auto-Building

Buildd status for libsoundio (stretch-staging)

Debian PTSTrackerChangelogBugspackages.d.obuildd.d.o

Package(s): Suite:
Compact mode Co-maintainers

ArchitectureVersionStatusForBuilddStateMiscLogs
Buildd exposure stats armhf  1.0.2-1Build-Attempted905d 12h 50mbm-wb-03uncompiledmisc:sourceold | all (17)

Tail of log for libsoundio on armhf:

 #error "require atomic_bool to be lock free"
  ^~~~~
cc1plus: warning: unrecognized command line option '-Wno-c99-extensions'
CMakeFiles/libsoundio_shared.dir/build.make:65: recipe for target 'CMakeFiles/libsoundio_shared.dir/src/soundio.cpp.o' failed
make[3]: *** [CMakeFiles/libsoundio_shared.dir/src/soundio.cpp.o] Error 1
make[3]: Leaving directory '/<<PKGBUILDDIR>>/obj-arm-linux-gnueabihf'
CMakeFiles/Makefile2:393: recipe for target 'CMakeFiles/libsoundio_shared.dir/all' failed
make[2]: *** [CMakeFiles/libsoundio_shared.dir/all] Error 2
make[2]: Leaving directory '/<<PKGBUILDDIR>>/obj-arm-linux-gnueabihf'
Makefile:130: recipe for target 'all' failed
make[1]: *** [all] Error 2
make[1]: Leaving directory '/<<PKGBUILDDIR>>/obj-arm-linux-gnueabihf'
dh_auto_build: make -j1 returned exit code 2
debian/rules:8: recipe for target 'build-arch' failed
make: *** [build-arch] Error 2