Raspbian Package Auto-Building

Buildd status for librsb (stretch-staging)

Debian PTSTrackerChangelogBugspackages.d.obuildd.d.o

Package(s): Suite:
Compact mode Co-maintainers

ArchitectureVersionStatusForBuilddStateMiscLogs
Buildd exposure stats armhf  1.2.0-rc5-3+deb9u1Build-Attempted797d 22h 31mbm-wb-04uncompiledmisc:extraold | all (1)

Tail of log for librsb on armhf:

Checking hardcoded RSB_USER_SET_MEM_HIERARCHY_INFO symbol
Checking hardcoded RSB_DETECTED_MEM_HIERARCHY_INFO symbol
Available memory hierarchy info string: ""
./scripts/readme-tests.sh: line 2: 25233 Aborted                 ./rsbench -oa -Ob -f ${srcdir}/A.mtx -qH -R -n1 -t100 --verbose
Makefile:2621: recipe for target 'mtests' failed
make[3]: *** [mtests] Error 255
make[3]: Leaving directory '/<<PKGBUILDDIR>>'
Makefile:2627: recipe for target 'qtests' failed
make[2]: *** [qtests] Error 2
make[2]: Leaving directory '/<<PKGBUILDDIR>>'
debian/rules:23: recipe for target 'override_dh_auto_test' failed
make[1]: *** [override_dh_auto_test] Error 2
make[1]: Leaving directory '/<<PKGBUILDDIR>>'
debian/rules:6: recipe for target 'build-arch' failed
make: *** [build-arch] Error 2