Raspbian Package Auto-Building

Buildd status for librandomx (bullseye-staging)

Debian PTSTrackerChangelogBugspackages.d.obuildd.d.o

Package(s): Suite:
Compact mode Co-maintainers

ArchitectureVersionStatusForBuilddStateMiscLogs
Buildd exposure stats armhf  1.1.7-4Build-Attempted67d 8h 48mmb-lxc-02uncompiledmisc:extraold | all (4)

Tail of log for librandomx on armhf:

collect2: error: ld returned 1 exit status
make[3]: *** [CMakeFiles/randomx-benchmark.dir/build.make:103: randomx-benchmark] Error 1
make[3]: Leaving directory '/<<PKGBUILDDIR>>/obj-arm-linux-gnueabihf'
make[2]: *** [CMakeFiles/Makefile2:85: CMakeFiles/randomx-benchmark.dir/all] Error 2
make[2]: *** Waiting for unfinished jobs....
[100%] Linking CXX executable randomx-tests
/usr/bin/cmake -E cmake_link_script CMakeFiles/randomx-tests.dir/link.txt --verbose=1
/usr/bin/c++  -g -O2 -fdebug-prefix-map=/<<PKGBUILDDIR>>=. -fstack-protector-strong -Wformat -Werror=format-security -Wdate-time -D_FORTIFY_SOURCE=2  -Wl,-z,relro -rdynamic CMakeFiles/randomx-tests.dir/src/tests/tests.cpp.o  -o randomx-tests  -Wl,-rpath,/<<PKGBUILDDIR>>/obj-arm-linux-gnueabihf librandomx.so.0.0.0 
make[3]: Leaving directory '/<<PKGBUILDDIR>>/obj-arm-linux-gnueabihf'
[100%] Built target randomx-tests
make[2]: Leaving directory '/<<PKGBUILDDIR>>/obj-arm-linux-gnueabihf'
make[1]: *** [Makefile:133: all] Error 2
make[1]: Leaving directory '/<<PKGBUILDDIR>>/obj-arm-linux-gnueabihf'
dh_auto_build: error: cd obj-arm-linux-gnueabihf && make -j4 "INSTALL=install --strip-program=true" returned exit code 2
make: *** [debian/rules:46: binary-arch] Error 25