Raspbian Package Auto-Building

Buildd status for libnunc-stans (stretch-staging)

Debian PTSTrackerChangelogBugspackages.d.obuildd.d.o

Package(s): Suite:
Compact mode Co-maintainers

ArchitectureVersionStatusForBuilddStateMiscLogs
Buildd exposure stats armhf  0.1.8-1Build-Attempted902d 2h 38mmb-lxc-01uncompiledmisc:sourceold | all (7)

Tail of log for libnunc-stans on armhf:

/tmp/ccxx6j3c.s: Assembler messages:
/tmp/ccxx6j3c.s:54: Error: selected processor does not support `ldrexd r6,r7,[lr]' in ARM mode
/tmp/ccxx6j3c.s:54: Error: selected processor does not support `strexd r0,r2,r3,[lr]' in ARM mode
makefile.linux:76: recipe for target 'obj/abstraction_dcas.o' failed
make[3]: *** [obj/abstraction_dcas.o] Error 1
make[3]: Leaving directory '/<<PKGBUILDDIR>>/liblfds'
Makefile:921: recipe for target 'all-recursive' failed
make[2]: *** [all-recursive] Error 1
make[2]: Leaving directory '/<<PKGBUILDDIR>>'
Makefile:646: recipe for target 'all' failed
make[1]: *** [all] Error 2
make[1]: Leaving directory '/<<PKGBUILDDIR>>'
dh_auto_build: make -j1 returned exit code 2
debian/rules:21: recipe for target 'build-arch' failed
make: *** [build-arch] Error 2